program: Gaussian 09
title: 000272151
version: EM64L-G09RevD.01
frameworkgroup: C1[X(C16H15N)]
method: RPBEPBE
basis: SDD
operation: Freq
keyword: #pfreq=noraman
keyword: PBEPBE/SDD
title: #p freq=noraman PBEPBE/SDD
converged: YES YES NO NO
title: Mulliken charges:
elementType: N C C C C C C C C C C C C C C C C H H H H H H H H H H H H H H H
charge: -0.054421 -0.438695 -0.544944 -0.566882 0.312353 0.346353 0.132731 -0.392547 -0.365040 -0.404225 -0.248788 -0.263794 0.125900 -0.319303 -0.207101 -0.374734 -0.190955 0.222232 0.211629 0.227539 0.220438 0.208930 0.243950 0.230846 0.232254 0.237376 0.228116 0.228080 0.256785 0.235831 0.239510 0.230576
chargesum: 0.00000
title: Mulliken charges with hydrogens summed into heavy atoms:
elementType: N C C C C C C C C C C C C C C C C
charge: -0.054421 -0.004834 -0.096968 -0.114002 0.312353 0.346353 0.132731 -0.161701 -0.132787 -0.166848 -0.020672 -0.035714 0.125900 -0.062519 0.028731 -0.135223 0.039621
polarizability: 3.30359172e+02 -2.27552990e+00 1.69516863e+02 -2.69663757e+00 -1.04096272e+01 9.66217148e+01
1716.lowfreq: -9.8351 -6.7731 -0.0009 -0.0004 -0.0001 9.4030 32.7623 52.2375 67.4186
frequency: 32.5933 52.2230 67.3955 125.3503 134.7632 177.3851 198.2325 247.6318 283.1601 340.5077 380.3454 391.7372 409.2368 439.3081 459.0665 496.9731 516.0082 561.5569 578.9721 608.3362 629.8044 655.2694 717.0943 729.3358 744.0689 760.9954 775.5528 799.8778 825.6044 860.8129 878.1805 884.1479 893.1465 906.5761 927.5857 954.2886 955.2123 957.7109 987.5797 994.0164 1017.7002 1040.7740 1045.3918 1064.3722 1080.8511 1088.3235 1123.6397 1149.3454 1166.2373 1177.2219 1189.7660 1205.4794 1218.4541 1250.8051 1270.2888 1275.7223 1300.3234 1317.5025 1323.0370 1341.4552 1347.8012 1367.9149 1382.1949 1410.5973 1443.1647 1446.0653 1452.5681 1465.2751 1472.0088 1482.9650 1554.9915 1572.3641 1577.0628 1603.0294 1625.1906 2953.1239 2953.9351 2990.8252 3025.4221 3051.7912 3064.2663 3113.5978 3121.3118 3129.0140 3132.7522 3136.2393 3147.7415 3162.5909 3163.5277 3174.8299
redmass: 3.7987 4.6530 4.0696 2.8608 3.6759 4.7485 3.7698 4.4160 2.1034 4.2167 3.9333 3.1607 3.5742 2.7264 3.4679 3.7776 2.8513 2.9211 5.6884 6.6282 3.2635 4.4080 3.6996 2.3876 1.8830 1.5614 2.2874 3.1605 3.4837 1.4538 1.5130 1.4451 1.5446 2.1409 2.5398 2.7626 1.4561 1.9566 1.3359 1.3349 3.1884 2.3603 2.3563 1.8687 1.9124 1.7394 1.8237 1.1961 1.0985 1.1149 1.3759 2.0333 2.0215 1.5881 1.5032 2.1090 1.6958 2.6916 1.5996 1.7395 1.5270 1.9385 3.2995 1.8702 2.3855 2.2550 1.1740 1.0927 1.0948 2.2347 5.0508 5.8062 6.2279 6.0062 7.6660 1.0679 1.0662 1.0614 1.0929 1.1027 1.0929 1.0873 1.0886 1.0878 1.0878 1.0892 1.0926 1.0952 1.0997 1.0990
irintensity: 0.4208 1.5982 0.4824 1.3630 1.3609 0.8366 1.6200 1.7888 1.0259 1.5348 0.1551 0.5457 4.3415 6.0154 0.9621 5.5469 11.1386 2.7574 9.3765 1.6347 1.3046 0.6672 6.8540 12.4410 37.8111 19.8124 56.2131 13.8912 5.0811 3.7964 1.5022 24.0619 10.2091 7.5426 4.2933 2.7068 0.1667 4.2456 0.0954 0.1410 0.9679 5.1491 2.4453 5.3251 0.4554 7.5492 3.7602 0.5929 3.9149 0.3945 1.9524 0.5895 5.7100 2.7358 7.5506 1.1161 7.5586 4.4910 2.3110 0.5049 1.0478 1.5128 3.3736 18.5811 36.2086 55.6288 3.2611 9.1854 9.8731 30.8698 16.8081 77.7212 39.7221 12.4189 55.0593 31.1503 16.6632 32.2125 45.1562 44.8157 21.5206 15.5424 28.0298 12.2609 12.0548 10.3252 23.6928 39.4983 30.9515 13.2430
temp: 298.150 k
press: 1.00000 atm
elementType: 7 6 6 6 6 6 6 6 6 6 6 6 6 6 6 6 6 1 1 1 1 1 1 1 1 1 1 1 1 1 1 1
symmnumber: 1
zpe: 690894.2 jmol-1
zpe.correction: 0.263148 hartree
zpe.thermalcorrener: 0.276649 hartree
zpe.thermalcorrenthalpy: 0.277593 hartree
zpe.thermalcorrgfe: 0.222045 hartree
zpe.sumelectzpe: -672.259765 hartree
zpe.sumelectthermal: -672.246264 hartree
zpe.sumelectthermalent: -672.245320 hartree
zpe.sumelectthermalfe: -672.300868 hartree
dipole: -0.0598 2.4662 -1.2577
dipole: 2.7690
quadrupole: -82.4107 -93.8549 -104.1489
quadrupole: -3.2287 3.0414 -0.3376
quadrupole: 11.0608 -0.3834 -10.6774 -3.2287 3.0414 -0.3376
hfenergy: -672.5229129 hartree
pointgroup: C01 [X(C16H15N1)]
dipole: 0.0683677 -0.702081 -0.8302056 debye
polarizability: 330.1911414|5.6105582|151.3947992|2.2616193|33.3619551|114.9118094 unknown
InChI: InChI=1S/C16H15N/c1-2-10-16-13(6-1)7-5-8-14(16)12-15-9-3-4-11-17-15/h1-4,6,9-12H,5,7-8H2
charge 0 multiplicity 1
32 atoms
N  2.953262 1.056247 1.219705
C  -1.010654 -2.559906 -0.302355
C  -2.456877 -2.135111 -0.607077
C  -0.01718 -1.496872 -0.829827
C  -2.742332 -0.70034 -0.177017
C  -0.255322 -0.152249 -0.151686
C  -1.684719 0.242247 0.037439
C  -4.087684 -0.294773 0.001091
C  -2.041977 1.578207 0.391881
C  0.765058 0.635031 0.33658
C  -4.419499 1.023357 0.37292
C  -3.382195 1.967623 0.563694
C  2.222426 0.481959 0.19339
C  2.878551 -0.12663 -0.91932
C  4.2870 -0.190652 -0.948778
C  4.310024 0.978284 1.173798
C  5.027506 0.357299 0.123488
H  -0.871497 -2.675659 0.789861
H  -0.793006 -3.539223 -0.768574
H  -3.17728 -2.820851 -0.122127
H  -2.635254 -2.223021 -1.700265
H  -0.14957 -1.404154 -1.929376
H  1.015171 -1.840092 -0.651514
H  -4.885201 -1.032406 -0.154713
H  -1.258204 2.333119 0.50956
H  0.513035 1.48617 0.980065
H  -5.4674 1.314283 0.505794
H  -3.619598 3.002476 0.834038
H  2.29652 -0.498174 -1.766349
H  4.79862 -0.648624 -1.802476
H  4.84046 1.44524 2.012627
H  6.12142 0.327292 0.139224
