program: Gaussian 09
title: 000272140
version: EM64L-G09RevD.01
frameworkgroup: C1[X(C12H5ClN2O4)]
method: RPBEPBE
basis: SDD
operation: Freq
keyword: #p
keyword: freq=noraman
keyword: PBEPBE/SDD
title: #p freq=noraman PBEPBE/SDD
converged: NO YES NO NO
title: Mulliken charges:
elementType: Cl O O O O N N C C C C C C C C C C C C H H H H H
charge: 0.216144 -0.187163 -0.193549 -0.195373 -0.181683 -0.538867 0.018202 0.135364 0.190226 0.494450 0.173399 -0.524273 -0.596556 0.435707 0.162273 0.156402 -0.421468 -0.344189 -0.229272 0.329115 0.303230 0.261463 0.286114 0.250304
chargesum: 0.00000
title: Mulliken charges with hydrogens summed into heavy atoms:
elementType: Cl O O O O N N C C C C C C C C C C C C
charge: 0.216144 -0.187163 -0.193549 -0.195373 -0.181683 -0.538867 0.018202 0.135364 0.190226 0.494450 0.173399 -0.195158 -0.293326 0.435707 0.162273 0.156402 -0.160004 -0.058075 0.021032
polarizability: 2.61492001e+02 -7.11906698e+00 2.29559416e+02 5.69514825e-03 -1.84304213e-02 5.95416321e+01
1716.lowfreq: -7.0276 -0.0017 -0.0012 0.0015 6.1392 6.4500 53.2060 53.6138 73.5604
frequency: 53.2011 53.6098 73.5602 109.7920 136.3402 153.1735 211.9142 212.9973 251.1477 278.9218 286.7714 297.6040 310.7626 346.9631 408.9313 429.4100 437.6523 486.2398 525.7052 537.6036 544.7357 582.4253 601.7576 602.7364 680.1910 700.9086 716.2974 724.5956 732.7463 780.5044 789.7479 839.9952 840.0701 914.1910 944.5586 953.3736 978.1107 980.5011 1011.0939 1031.6295 1077.5003 1097.2362 1141.4748 1157.9242 1193.0082 1202.7524 1206.0701 1255.6792 1283.1179 1366.8014 1380.8063 1413.8675 1421.1508 1444.2292 1452.6239 1522.0236 1582.4293 1591.5886 1593.7048 1626.1991 1632.1357 3143.4327 3159.3060 3170.6632 3176.1676 3183.3964
redmass: 14.0001 15.4832 12.3750 7.2256 15.1471 7.3458 5.5768 12.4859 5.0351 13.4952 6.8098 15.8064 10.8752 8.8779 9.7514 9.4829 5.0433 4.2623 8.3096 4.9523 7.8836 9.0091 4.0564 6.6911 9.6072 4.4616 6.4452 6.6673 12.6471 7.7426 2.1699 6.3996 2.2702 8.9645 1.4027 7.0095 1.4678 1.5145 1.3957 4.0818 1.8323 2.9968 2.8948 4.3902 1.3566 1.5030 11.8461 2.9183 2.4093 6.1332 4.8315 3.7831 4.3284 9.3419 2.9330 5.3820 7.0653 7.6459 11.8726 11.6276 8.4268 1.0887 1.0919 1.0926 1.0988 1.0926
irintensity: 0.7117 0.0119 2.9005 1.1988 1.8561 1.8693 3.9312 1.3746 0.0063 1.2176 2.4938 1.5768 2.0236 9.4914 2.4077 6.3550 0.1147 0.4752 7.5981 17.0331 5.8425 31.5930 0.7497 1.9206 11.4627 4.2053 5.9120 7.9773 15.2840 51.8682 53.0814 1.6919 7.7498 15.1384 19.4546 2.7452 1.3671 26.3236 2.5300 17.9483 17.3112 99.3368 11.8275 53.7700 9.6330 6.9101 406.6980 47.2340 39.6029 42.9901 83.5872 1.7750 1.6367 15.2689 11.1723 2.3718 63.4993 17.9772 260.1738 33.8134 116.0855 1.0178 3.5096 4.3318 10.0073 16.2435
temp: 298.150 k
press: 1.00000 atm
elementType: 17 8 8 8 8 7 7 6 6 6 6 6 6 6 6 6 6 6 6 1 1 1 1 1
symmnumber: 1
zpe: 394933.7 jmol-1
zpe.correction: 0.150422 hartree
zpe.thermalcorrener: 0.164904 hartree
zpe.thermalcorrenthalpy: 0.165849 hartree
zpe.thermalcorrgfe: 0.108084 hartree
zpe.sumelectzpe: -1329.362862 hartree
zpe.sumelectthermal: -1329.348380 hartree
zpe.sumelectthermalent: -1329.347436 hartree
zpe.sumelectthermalfe: -1329.405201 hartree
dipole: 0.1980 6.2527 0.0079
dipole: 6.2558
quadrupole: -142.5107 -108.3393 -113.1381
quadrupole: 10.8090 -0.0138 -0.0114
quadrupole: -21.1813 12.9901 8.1912 10.8090 -0.0138 -0.0114
hfenergy: -1329.5132848 hartree
pointgroup: C01 [X(C12H5Cl1N2O4)]
dipole: 0.3328213 2.4386256 -0.0039111 debye
dipolederiv: -0.236946 0.2751468 -0.0003618 0.2982891 -0.2000747 0.0003565 -0.0010258 0.0009221 0.0984737 -0.4527258 -0.0809313 -0.0001546 -0.1361539 -1.0037454 -0.0009755 0.0012369 0.001877 -0.3082319 -1.0951402 -0.2131921 0.0010079 -0.0950782 -0.4591724 0.0001784 -0.002021 -0.001379 -0.3136624 -0.9308843 0.1085076 0.0002294 0.1622172 -0.5051855 -0.0001362 0.0003248 -0.0001129 -0.2186709 -0.6606338 -0.1929203 0.0000942 -0.1856751 -0.7114201 -0.0000581 0.0001725 -0.0000428 -0.2094986 -0.4443779 -0.8917401 0.0009186 -0.88749 -0.5095416 -0.0008593 0.0016767 -0.0014591 -0.2055595 1.918909 0.2794172 -0.0005034 0.2320356 1.0694883 0.0001567 -0.0007985 0.0001158 0.1834668 0.1332392 0.2340736 -0.0000753 0.124049 -0.0125145 0.0000311 0.0006121 -0.0006399 -0.0179843 -0.4902959 0.168525 -0.0000371 -0.092984 -0.113933 0.0001054 0.0005344 -0.0001246 0.0233393 -0.3179786 -0.0138791 0.0001589 0.032546 -0.0727897 -0.0000582 0.0002428 -0.0000573 0.0790483 -0.2228537 -0.1041892 -0.0000727 0.2178415 -0.4654267 0.0000762 0.0001861 -0.0005021 0.0164235 0.2372854 -0.0805077 -0.0001317 -0.1049306 -0.0405499 0.0001832 -0.0000197 -0.0000741 -0.0623173 0.1949899 0.1419153 -0.0001542 0.2763148 0.1871034 -0.0000288 -0.0000861 0.0001448 -0.1000539 -0.5283976 -0.2016757 0.0001017 -0.2653135 -0.2893737 0.0000089 0.0002028 0.000028 0.0649886 1.316425 0.1343921 -0.000071 0.2678682 1.0858851 0.0008456 -0.0020366 -0.0006091 0.2536993 1.1960439 0.3373085 -0.0008767 0.0523452 1.300996 0.0000021 0.0006066 0.0019799 0.2561456 0.182683 -0.1210736 -0.0001292 0.1369876 0.0989316 0.0000938 -0.0001341 0.0001399 -0.1280057 0.1371332 0.0550378 -0.0002105 -0.1987905 0.1701211 0.0000953 -0.0000156 0.0000081 -0.0639402 -0.3532876 0.1180273 0.0001135 0.1128233 0.175931 0.0001843 0.0001119 0.0001731 -0.1443496 0.1823342 -0.0065915 -0.0000097 0.0092957 0.1248198 -0.0000386 0.0000399 -0.0000443 0.1653264 0.117017 0.0276225 0.0000305 0.041817 0.0819654 -0.0000492 0.0000614 -0.0000878 0.1639337 0.0100221 0.1032873 0.0000815 0.0387218 0.0322418 -0.0000427 0.0001015 -0.0001235 0.1538017 0.0321278 -0.0394081 0.0000734 -0.0020346 0.1345957 0. 0.0000985 -0.0000526 0.150543 0.0753115 -0.0371523 -0.0000218 -0.0347014 -0.0783522 -0.0000707 -0.0000717 -0.0000796 0.1630845 unknown
polarizability: 262.9443859|1.4809525|228.1070209|0.0238285|-0.0394707|59.5416421 unknown
InChI: InChI=1S/C12H5ClN2O4/c13-14-11(16)8-3-1-2-6-4-7(15(18)19)5-9(10(6)8)12(14)17/h1-5H
charge 0 multiplicity 1
24 atoms
Cl 3.633324 -2.6605 0.003481
O  0.726467 -3.106401 0.002091
O  4.015815 0.25625 0.00198
O  -4.709823 0.357807 0.001232
O  -4.086804 -1.83727 0.000595
N  2.338146 -1.392888 -0.000818
N  -3.819795 -0.576787 0.000723
C  0.325064 0.579794 -0.001183
C  -0.045009 -0.804824 -0.00132
C  -0.705429 1.593477 -0.000361
C  1.697989 0.976933 -0.001381
C  -1.391554 -1.184733 -0.000528
C  -2.074672 1.190756 0.000141
C  -2.386519 -0.171071 0.000064
C  0.99381 -1.880976 -0.00217
C  2.795237 -0.036541 -0.002271
C  -0.324442 2.975929 0.000108
C  2.040859 2.338699 -0.000616
C  1.026257 3.339371 -0.000004
H  -1.669859 -2.242073 -0.000601
H  -2.882463 1.928841 0.000755
H  -1.106933 3.742845 0.000704
H  3.101832 2.608489 -0.000755
H  1.311705 4.395576 0.000436
