program: Gaussian 09
title: 000272129
version: EM64L-G09RevD.01
frameworkgroup: C1[X(C7H10O2)]
method: RPBEPBE
basis: SDD
operation: Freq
keyword: #pfreq=noraman
keyword: PBEPBE/SDD
title: #p freq=noraman PBEPBE/SDD
converged: NO NO NO NO
title: Mulliken charges:
elementType: O O C C C C C C C H H H H H H H H H H
charge: -0.204614 -0.204627 0.134559 -0.527853 -0.527861 0.139545 0.139582 -0.762422 -0.762424 0.285441 0.259478 0.285449 0.259464 0.230561 0.253670 0.258910 0.230558 0.253673 0.258910
chargesum: 0.00000
title: Mulliken charges with hydrogens summed into heavy atoms:
elementType: O O C C C C C C C
charge: -0.204614 -0.204627 0.134559 0.017066 0.017052 0.139545 0.139582 -0.019281 -0.019283
polarizability: 8.34820070e+01 2.14192733e-04 8.09301884e+01 5.18547752e+00 -7.92289375e-05 6.82215496e+01
1716.lowfreq: -122.6935 -75.0777 -13.9735 -6.0549 0.0011 0.0011 0.0014 9.4526 42.0123
frequency: -122.6911 -74.8370 41.9553 73.9377 195.1474 200.6890 245.8222 258.0733 383.8704 386.0965 435.1190 573.5252 578.4760 603.9980 623.4386 795.3358 828.2835 843.0583 897.1334 936.4283 953.1933 990.7206 1026.6023 1033.1987 1052.5612 1089.2453 1113.9067 1159.7278 1177.9630 1290.7726 1301.8540 1367.2003 1377.1285 1423.4920 1434.0364 1443.9297 1446.5358 1450.0015 1461.6074 1593.9405 1619.9382 2992.1612 2995.0812 3076.3196 3081.9736 3102.2667 3106.6799 3128.0778 3129.4871 3211.2730 3227.2604
redmass: 1.0527 1.0674 4.3824 4.2302 3.4325 3.5333 2.1114 3.7391 3.9329 3.1345 6.0376 3.4178 2.5360 3.0031 3.6230 1.1563 4.4187 1.6939 4.4638 1.2894 1.8915 1.6388 1.8603 1.8341 1.1500 1.3697 2.1624 3.2776 1.3267 4.0860 4.4625 1.2514 1.2401 1.0849 1.1188 1.1937 1.0765 1.0589 1.0519 8.1363 7.6080 1.0374 1.0379 1.0959 1.0936 1.0494 1.0605 1.1005 1.1002 1.1187 1.1167
irintensity: 1.2429 1.8770 6.6753 3.4920 5.4651 1.6738 0.5251 5.7740 8.4573 1.3306 0.1260 15.8346 6.2248 1.9293 1.2531 0.4230 8.5019 13.9198 11.9816 6.0261 7.3668 14.0710 7.9409 4.1741 12.9320 7.5846 61.7409 47.8004 0.1673 71.3245 138.3955 51.3229 69.8730 20.0372 1.3008 0.4408 44.0681 32.4427 23.8983 263.2996 1.5439 2.7809 2.6421 8.7486 16.2383 11.3057 4.7141 20.2983 1.9609 0.0329 0.9316
temp: 298.150 k
press: 1.00000 atm
elementType: 8 8 6 6 6 6 6 6 6 1 1 1 1 1 1 1 1 1 1
symmnumber: 1
zpe: 399304.6 jmol-1
zpe.correction: 0.152087 hartree
zpe.thermalcorrener: 0.160898 hartree
zpe.thermalcorrenthalpy: 0.161842 hartree
zpe.thermalcorrgfe: 0.117781 hartree
zpe.sumelectzpe: -422.457612 hartree
zpe.sumelectthermal: -422.448801 hartree
zpe.sumelectthermalent: -422.447857 hartree
zpe.sumelectthermalfe: -422.491918 hartree
dipole: -0.0006 -1.2850 0.0009
dipole: 1.2850
quadrupole: -66.5742 -48.6693 -53.4622
quadrupole: -0.0007 -8.8265 0.0002
quadrupole: -10.3390 7.5659 2.7731 -0.0007 -8.8265 0.0002
hfenergy: -422.6096996 hartree
pointgroup: C01 [X(C7H10O2)]
dipole: 0.0003964 0.5055605 -0.0004582 debye
dipolederiv: -0.8632881 -0.090534 0.1814959 0.0382919 -0.428582 -0.1659836 0.2135607 -0.1269817 -0.4594172 -0.8634199 0.09144 0.1812302 -0.0373503 -0.4277907 0.1656893 0.2137136 0.126697 -0.4601784 -0.6512637 0.0000413 0.039771 0.0002766 -0.8814085 0.0014309 0.1338095 0.001399 -0.0013319 -0.0315625 0.0025255 0.000438 -0.0961551 0.1587986 0.002506 -0.0178703 -0.1523677 -0.0782126 -0.0314831 -0.0023446 0.0004404 0.0960837 0.1592038 -0.003332 -0.0181497 0.1516192 -0.0787315 1.162405 0.4423872 -0.1631581 0.3370146 0.6832846 0.4108365 -0.232199 0.4198202 0.4710589 1.1619395 -0.4432911 -0.1619982 -0.3380577 0.6816669 -0.4113264 -0.2313899 -0.4202894 0.473367 -0.0277252 -0.0247433 0.0059885 -0.0667243 -0.2811106 -0.2495059 -0.0057193 -0.2859007 -0.1913862 -0.0276239 0.0244536 0.0061641 0.0664327 -0.2796315 0.2497549 -0.0056178 0.2861768 -0.1929445 0.044213 0.0524307 0.0651276 0.0504258 0.0866569 -0.0235685 0.0095179 -0.0345668 0.0568634 -0.0109183 -0.0382525 -0.0829876 -0.0340982 0.0867991 -0.0386398 -0.0519242 -0.0508244 0.0369143 0.0441308 -0.0521735 0.0653267 -0.0503389 0.0869247 0.0234308 0.009708 0.0344484 0.0566782 -0.0108557 0.0380569 -0.0830815 0.0340562 0.0870297 0.0385502 -0.0519997 0.0507131 0.0366182 0.0312213 0.1089423 -0.05066 0.0953169 0.0034712 0.024745 -0.0368084 0.078888 0.0922734 0.092729 -0.0536934 0.0521988 -0.0218207 0.0671831 0.0807733 0.0480299 0.0335254 -0.0277213 -0.0712357 -0.0955974 -0.0288207 -0.0446349 0.0636936 -0.0256172 0.0060656 -0.0217703 0.1005293 0.0309898 -0.109102 -0.0503756 -0.0954411 0.0033761 -0.0244181 -0.0366147 -0.0785839 0.0925798 0.0928265 0.0538007 0.0519624 0.0219307 0.0667672 -0.0810886 0.047919 -0.0338501 -0.0273753 -0.0710789 0.0956537 -0.0290617 0.0447919 0.063668 0.0257633 0.005969 0.0218479 0.1004164 unknown
polarizability: 84.2807398|-0.0072185|80.9301581|-3.7499487|-0.0203883|67.422847 unknown
InChI: InChI=1S/C7H10O2/c1-5(8)7(3-4-7)6(2)9/h3-4H2,1-2H3
charge 0 multiplicity 1
19 atoms
O  2.348067 -0.158566 -0.528144
O  -2.341024 -0.154998 0.528332
C  0.003437 -0.478152 0.000856
C  0.012993 -1.836737 -0.75675
C  -0.007344 -1.834215 0.76295
C  1.325438 0.261563 0.081735
C  -1.317887 0.26248 -0.082519
C  1.411672 1.443142 1.041142
C  -1.402835 1.441464 -1.045217
H  0.956253 -2.067405 -1.259943
H  -0.9050 -2.118778 -1.278584
H  -0.95082 -2.062397 1.266877
H  0.910391 -2.115377 1.285713
H  0.740527 2.269242 0.747805
H  1.097386 1.123399 2.052522
H  2.446145 1.816321 1.075561
H  -0.73075 2.267634 -0.754262
H  -1.08895 1.1185 -2.055703
H  -2.436897 1.81568 -1.080672
