program: Gaussian 09
title: 000272123
version: EM64L-G09RevD.01
frameworkgroup: C1[X(C8H13NO)]
method: RPBEPBE
basis: SDD
operation: Freq
keyword: #p
keyword: freq=noraman
keyword: PBEPBE/SDD
title: #p freq=noraman PBEPBE/SDD
converged: YES YES NO NO
title: Mulliken charges:
elementType: O N C C C C C C C C H H H H H H H H H H H H H
charge: -0.251223 -0.074395 -0.393266 -0.489452 0.297458 0.063638 -0.292792 -0.497986 -0.606122 -0.687824 0.221316 0.231382 0.236153 0.236157 0.236442 0.229035 0.183233 0.227665 0.236040 0.228292 0.209252 0.254143 0.202852
chargesum: 0.00000
title: Mulliken charges with hydrogens summed into heavy atoms:
elementType: O N C C C C C C C C
charge: -0.251223 -0.074395 0.059432 -0.017142 0.297458 0.063638 -0.056350 -0.085718 0.085875 -0.021577
polarizability: 1.29625132e+02 -1.02693060e+01 9.85915295e+01 2.88148280e+00 2.30653802e+00 6.67308606e+01
1716.lowfreq: -10.2728 -0.0006 -0.0003 0.0003 7.9942 9.4285 64.2000 81.1432 105.4086
frequency: 64.1726 81.1149 105.3981 144.6178 169.8889 205.1300 234.7635 287.6424 325.7317 377.5006 393.4970 426.9027 468.5676 512.0584 616.4586 672.8773 734.4385 774.7429 807.5577 874.5021 907.8404 965.0447 1001.8392 1043.9807 1057.5579 1068.4512 1087.3043 1110.5451 1113.2668 1162.4684 1206.7708 1217.7087 1257.6564 1292.1202 1318.8442 1324.3583 1342.3206 1379.2025 1388.7327 1410.3107 1438.1696 1441.0381 1456.6184 1462.4472 1469.6853 1471.7929 1489.6245 1495.9492 1561.1126 1626.0849 2920.9850 2943.4026 2975.9971 2979.4344 2985.3381 3032.7654 3034.9631 3040.3623 3070.1225 3079.5960 3094.1278 3095.8307 3114.9256
redmass: 2.4471 3.6387 1.6041 1.9588 2.0098 1.2735 2.4835 1.7326 3.2105 3.4074 3.1728 3.7634 4.2379 3.0032 2.9409 3.7841 2.2632 1.9130 1.8577 2.4194 1.4203 2.0543 2.2802 1.9941 2.4388 1.7582 1.6604 1.6315 1.5264 1.7084 1.5963 1.5450 1.2438 1.7421 1.3755 1.5443 1.7295 1.2709 1.6874 2.7872 1.1162 1.2287 1.0976 1.0564 1.0985 1.0530 1.0573 1.1406 8.9546 5.3626 1.0686 1.0443 1.0442 1.0513 1.0650 1.0915 1.1004 1.0925 1.1000 1.0961 1.1003 1.0989 1.0917
irintensity: 1.2502 2.5480 4.6293 0.2564 3.5958 1.7246 5.3904 1.5662 2.8707 1.0274 13.5368 9.6458 6.9110 1.2483 1.1338 6.3100 3.1978 1.2608 6.4228 19.0513 9.9101 13.0849 7.5513 7.1069 1.7039 27.1265 17.0655 41.6784 7.9449 1.5669 59.3890 11.2444 2.5828 49.9766 7.9072 43.4788 46.1007 13.9357 50.4376 48.7728 7.7381 4.9838 9.5002 19.8704 3.1290 14.4897 15.7182 21.8965 280.8640 232.6652 49.8162 129.8862 47.8001 42.3138 17.4046 37.0015 7.5473 37.8413 60.5729 13.7973 26.1540 15.8449 18.7763
temp: 298.150 k
press: 1.00000 atm
elementType: 8 7 6 6 6 6 6 6 6 6 1 1 1 1 1 1 1 1 1 1 1 1 1
symmnumber: 1
zpe: 515675.8 jmol-1
zpe.correction: 0.196411 hartree
zpe.thermalcorrener: 0.207159 hartree
zpe.thermalcorrenthalpy: 0.208104 hartree
zpe.thermalcorrgfe: 0.160113 hartree
zpe.sumelectzpe: -441.831305 hartree
zpe.sumelectthermal: -441.820556 hartree
zpe.sumelectthermalent: -441.819612 hartree
zpe.sumelectthermalfe: -441.867602 hartree
dipole: 5.5131 -2.9357 0.3663
dipole: 6.2568
quadrupole: -58.6502 -61.7909 -61.4966
quadrupole: 5.1114 1.2070 1.4825
quadrupole: 1.9957 -1.1450 -0.8507 5.1114 1.2070 1.4825
hfenergy: -442.0277153 hartree
pointgroup: C01 [X(C8H13N1O1)]
dipole: 2.1626243 1.1751285 -0.0401736 debye
dipolederiv: -1.0002493 -0.3639007 -0.0320504 -0.3997738 -0.8571303 -0.0343209 -0.0528824 -0.0299597 -0.3485609 -1.5598342 -0.3379588 0.0789992 0.5106664 -0.2789941 -0.0808569 -0.0796726 -0.0507956 -0.3049057 0.1071725 -0.0636803 0.0448577 -0.3399747 0.2486352 0.1250702 -0.0102463 0.1099554 0.4078773 -0.2333881 0.1273595 0.0016166 0.1482456 -0.056793 -0.0155392 0.0266424 0.0006334 0.0941556 -0.4211513 -0.1977846 -0.0055966 -0.7800822 -0.7733136 -0.0102403 -0.2085293 -0.0812906 -0.1997781 0.9027316 0.1158705 0.0611129 0.662835 1.2831496 0.0804574 0.1744143 0.119692 0.1168656 1.530678 0.4062437 -0.0826732 -0.172582 0.1384899 0.082036 -0.1002476 0.0636706 -0.0383367 0.1332794 -0.0020689 -0.0114235 -0.0215251 0.1381589 0.0201331 -0.0803086 0.0089625 0.1259863 0.6543014 0.2510412 -0.0355128 0.3116921 0.2469025 -0.0813606 0.0613756 -0.0789383 0.2595229 -0.0009861 0.0251524 -0.0612661 0.0508656 0.0373228 -0.0096548 -0.0098662 -0.0285083 -0.0145454 -0.1699426 0.0971841 0.002458 0.0598171 0.057462 -0.0136404 -0.0353953 -0.0035486 0.0736029 0.0896328 -0.0253503 -0.0538282 0.0594366 0.0113073 0.0602134 0.0837185 -0.0100245 -0.1954371 0.0280325 0.0393364 -0.0270518 -0.0243816 0.0690986 0.0388081 -0.0267601 0.0967603 -0.0896351 0.0757336 -0.0180724 0.0020366 0.0124108 -0.0515206 -0.0836556 0.0245428 -0.1136126 0.0445133 0.1008779 -0.0012915 0.0040989 -0.0051249 -0.0949315 -0.069001 0.0327452 -0.0496719 0.1129341 -0.0372568 -0.0032072 0.077861 -0.0762265 0.0281121 0.1069673 0.0549454 0.0556783 -0.0301957 0.0141811 -0.0520939 -0.0684379 0.0327035 -0.1228808 -0.1336809 -0.0217838 -0.0905709 -0.0100444 -0.0756283 -0.0789181 0.0223323 -0.1347567 0.0359055 0.0338169 0.1764288 0.1250709 -0.1578576 -0.1566318 0.0052059 -0.0645156 0.1117241 0.0307305 0.0735912 -0.0749918 0.0503155 0.0570159 0.0808675 0.0558233 0.053527 -0.0335166 -0.0738441 -0.0916999 0.0072441 -0.1078144 0.0488074 -0.2014546 0.1456506 0.0117386 0.1583097 0.0299682 -0.0024417 0.0162556 -0.0131303 0.0617636 0.123978 -0.0169799 -0.0147301 -0.0749412 -0.0466016 -0.1087508 0.0061377 -0.0625326 0.0310555 0.0150567 -0.1075608 0.0964474 -0.0558212 0.0007667 0.1137495 0.0362334 0.0896593 -0.0448037 unknown
polarizability: 129.5574798|10.528496|98.4036145|-1.1066304|4.146962|66.986428 unknown
InChI: InChI=1S/C8H13NO/c1-3-7-6-9(2)5-4-8(7)10/h6H,3-5H2,1-2H3
charge 0 multiplicity 1
23 atoms
O  -1.714506 -1.804747 -0.055678
N  1.776014 0.498562 0.112487
C  1.813776 -0.814286 -0.571263
C  0.735968 -1.755168 -0.006396
C  -0.673376 0.346082 0.293967
C  -0.657258 -1.094796 0.034085
C  0.533649 1.033258 0.389472
C  -2.002813 1.043102 0.5257
C  2.979034 1.336429 0.045425
C  -2.790007 1.288646 -0.78863
H  2.821708 -1.250482 -0.445983
H  1.643583 -0.658975 -1.661476
H  0.995784 -2.049146 1.031019
H  0.676306 -2.679097 -0.606533
H  0.538713 2.084877 0.704087
H  -2.625962 0.413327 1.188954
H  -1.836296 2.007674 1.045756
H  3.241194 1.600972 -1.001168
H  3.841103 0.808899 0.493473
H  2.818291 2.270651 0.608466
H  -3.759298 1.780276 -0.582357
H  -2.992321 0.326907 -1.290363
H  -2.216783 1.931034 -1.482645
