program: Gaussian 09
title: 000272161
version: EM64L-G09RevD.01
frameworkgroup: C1[X(C18H18N2O4)]
method: RPBEPBE
basis: SDD
operation: Freq
keyword: #p
keyword: freq=noraman
keyword: PBEPBE/SDD
title: #p freq=noraman PBEPBE/SDD
converged: YES YES NO NO
title: Mulliken charges:
elementType: O O O O N N C C C C C C C C C C C C C C C C C C H H H H H H H H H H H H H H H H H H
charge: -0.256142 -0.259744 -0.217975 -0.210875 -0.279762 0.015508 -0.402479 -0.370764 -0.400487 -0.491860 0.156852 0.399519 0.239828 -0.474469 0.411193 -0.297138 -0.406935 -0.455005 0.470159 -0.359059 -0.441631 -0.224737 -0.221067 -0.231321 0.213896 0.211084 0.248968 0.225993 0.211673 0.220256 0.249116 0.234220 0.305996 0.259859 0.286229 0.232057 0.223466 0.251400 0.234208 0.233364 0.232257 0.234351
chargesum: 0.00000
title: Mulliken charges with hydrogens summed into heavy atoms:
elementType: O O O O N N C C C C C C C C C C C C C C C C C C
charge: -0.256142 -0.259744 -0.217975 -0.210875 -0.279762 0.015508 0.022501 0.104197 0.031442 -0.008525 0.156852 0.399519 0.239828 -0.168474 0.411193 -0.037279 -0.120706 0.000518 0.470159 -0.107659 -0.207424 0.008626 0.011190 0.003030
polarizability: 3.22398058e+02 -2.17075759e+01 2.17823634e+02 1.20493293e+01 1.82232256e+01 1.52728490e+02
1716.lowfreq: -7.9503 -4.2705 -3.1511 -0.0009 -0.0007 -0.0004 8.3028 11.7081 17.6208
frequency: -4.1059 11.2200 17.0919 34.7913 54.2799 56.9808 69.9009 100.6616 105.0370 123.0999 126.9352 136.4042 205.8340 230.8825 243.6724 251.4660 308.3978 312.7166 345.9721 362.1229 384.3708 401.0564 438.9186 447.3745 468.0518 474.2082 500.6025 505.7093 549.0783 564.7909 577.1602 610.8840 618.0064 633.4679 641.9618 687.1602 699.1615 702.1918 742.4029 744.5695 770.8878 791.3478 820.7527 825.6561 838.5862 854.6344 878.7023 896.3578 918.6986 922.0420 933.5046 935.4871 971.8235 978.6709 979.5370 989.4502 991.8653 999.6341 1001.2856 1026.7018 1079.0454 1089.7425 1092.0061 1095.2741 1135.3532 1142.9473 1160.0222 1172.7428 1174.6390 1188.7919 1191.9539 1205.6805 1215.2758 1227.6882 1250.3951 1255.7080 1265.7685 1271.9167 1300.0048 1324.5535 1324.8787 1343.8048 1352.7117 1354.0584 1359.7296 1387.5372 1396.8559 1406.0516 1425.2130 1441.2962 1447.7189 1468.8778 1472.7433 1474.6198 1485.5738 1490.6306 1494.5511 1581.5125 1589.4852 1596.7502 1609.9114 1617.4798 2969.1645 2985.1415 2986.9522 2990.4021 2992.0006 3034.8385 3038.3716 3049.0594 3059.4628 3071.5004 3121.6951 3129.6705 3140.6373 3152.5786 3165.8315 3167.7736 3187.2358 3191.4977
redmass: 4.4286 4.5422 5.5927 4.7333 5.6350 6.9535 4.9184 4.8844 3.5348 5.5771 2.9385 5.3336 7.1468 5.8542 5.4440 5.5163 2.2750 2.1122 5.5344 5.6961 4.5624 2.8002 3.8335 6.6919 3.4122 3.0558 3.5064 4.5899 4.6079 4.9103 5.3563 4.9484 5.8580 4.8109 3.5357 5.9266 5.3487 2.0190 3.2298 2.5319 3.8697 4.7632 1.5583 1.5173 3.6074 1.2487 2.8594 2.8013 1.7399 1.4098 1.8637 2.6813 1.3790 1.3959 2.2822 2.5021 2.7121 2.8236 1.3984 2.1793 1.9442 1.5347 1.5799 1.6822 1.9754 2.8306 2.0593 1.3178 1.0555 1.1252 1.1151 2.6546 6.0930 2.2973 2.0560 1.7058 1.3674 1.4398 1.8576 1.2956 1.4654 1.4604 1.5213 1.7205 4.7823 7.2158 4.4931 2.3297 4.0371 2.1620 1.1049 1.0918 1.2770 1.0946 2.4149 2.0277 1.1835 9.6491 8.8984 6.1152 7.3461 6.1201 1.0563 1.0575 1.0645 1.0632 1.0654 1.1071 1.1028 1.0984 1.1027 1.0972 1.0877 1.0867 1.0918 1.0965 1.0884 1.1017 1.0959 1.0933
irintensity: 1.4972 0.0807 1.0425 1.7854 0.4652 0.2685 1.4631 0.8622 1.9184 2.1868 1.4505 7.4026 0.5770 5.4841 3.0790 0.3545 1.9992 3.0003 1.0921 1.1458 0.8282 0.9924 1.8242 8.6555 2.6501 2.0912 13.1406 7.1497 2.1893 3.0157 4.3868 2.4374 1.1042 12.6043 25.8044 13.4281 9.2745 47.9272 11.9294 51.7270 8.0614 11.5761 41.4237 10.9384 16.2819 0.2877 7.8227 13.9089 74.1278 0.9981 54.3949 64.7563 2.7287 0.4550 11.8334 0.4733 1.4768 1.5333 0.0273 4.8712 57.7228 6.5219 19.4980 2.5616 98.7667 23.4668 58.6438 9.7581 0.2063 12.7541 2.9181 135.5269 470.9157 5.6239 193.8948 80.8240 11.3837 12.9797 133.8369 4.3959 11.4481 4.3652 6.1955 20.6393 69.4570 0.9929 16.4072 76.7546 54.8830 9.0405 4.2955 12.8124 55.1841 22.0498 8.2003 59.8839 30.7511 232.5541 18.2824 1.4295 97.5866 0.4036 29.3563 21.1454 30.5125 34.6426 12.9082 18.2100 21.5419 52.2342 41.3860 21.8368 6.6897 0.4106 13.5188 31.4475 8.1213 19.2210 2.8533 7.9234
temp: 298.150 k
press: 1.00000 atm
elementType: 8 8 8 8 7 7 6 6 6 6 6 6 6 6 6 6 6 6 6 6 6 6 6 6 1 1 1 1 1 1 1 1 1 1 1 1 1 1 1 1 1 1
symmnumber: 1
zpe: 862564.6 jmol-1
zpe.correction: 0.328533 hartree
zpe.thermalcorrener: 0.348898 hartree
zpe.thermalcorrenthalpy: 0.349842 hartree
zpe.thermalcorrgfe: 0.276015 hartree
zpe.sumelectzpe: -1105.303633 hartree
zpe.sumelectthermal: -1105.283269 hartree
zpe.sumelectthermalent: -1105.282324 hartree
zpe.sumelectthermalfe: -1105.356152 hartree
dipole: -9.3278 -0.3378 -3.6523
dipole: 10.0231
quadrupole: -167.7729 -123.9622 -141.9032
quadrupole: 4.9998 -5.0246 -2.7907
quadrupole: -23.2268 20.5839 2.6429 4.9998 -5.0246 -2.7907
hfenergy: -1105.6321664 hartree
pointgroup: C01 [X(C18H18N2O4)]
dipole: 3.7634991 0.0758545 1.1749854 debye
polarizability: 321.1924042|25.0787229|218.5203183|0.1678582|-21.8548296|153.2374591 unknown
InChI: InChI=1S/C18H18N2O4/c21-18-8-4-5-11-19(18)16-12-15(20(22)23)9-10-17(16)24-13-14-6-2-1-3-7-14/h1-3,6-7,9-10,12H,4-5,8,11,13H2
charge 0 multiplicity 1
42 atoms
O  0.853084 -0.755481 0.196657
O  -1.445656 1.865007 -1.88946
O  -5.297005 -2.507524 0.359088
O  -5.480797 -0.233353 0.42662
N  -0.71831 1.513442 0.297384
N  -4.781939 -1.319945 0.373755
C  0.379322 3.384579 1.569383
C  0.093871 1.876205 1.499606
C  0.925404 3.876458 0.215096
C  -0.147496 3.662167 -0.871604
C  -0.809132 2.280728 -0.874641
C  -1.330252 0.208663 0.303304
C  -0.520491 -0.970501 0.262914
C  -2.726876 0.08329 0.327618
C  -3.31297 -1.201538 0.335242
C  -1.127834 -2.254627 0.282112
C  -2.526986 -2.373147 0.316306
C  1.742264 -1.934453 -0.017063
C  3.143313 -1.415148 -0.237332
C  3.421604 -0.563243 -1.336974
C  4.193749 -1.785587 0.636485
C  4.733037 -0.091042 -1.556988
C  5.509967 -1.319965 0.412183
C  5.781514 -0.471396 -0.684805
H  1.106622 3.563027 2.38304
H  -0.545136 3.939288 1.823078
H  1.044469 1.309564 1.470123
H  -0.467425 1.547872 2.394298
H  1.844505 3.312211 -0.038996
H  1.203647 4.945247 0.264425
H  0.253927 3.816326 -1.888282
H  -0.964767 4.4009 -0.74749
H  -3.362049 0.97187 0.329868
H  -0.517602 -3.161142 0.264798
H  -3.019567 -3.348732 0.326474
H  1.367177 -2.485292 -0.902943
H  1.693132 -2.596019 0.869363
H  2.608464 -0.265383 -2.009006
H  3.985241 -2.437613 1.49371
H  4.940357 0.566899 -2.408021
H  6.316992 -1.61508 1.091578
H  6.800431 -0.108632 -0.8597
