program: Gaussian 09
title: 000272100
version: EM64L-G09RevD.01
frameworkgroup: C1[X(C16H14O2)]
method: RPBEPBE
basis: SDD
operation: Freq
keyword: #pfreq=noraman
keyword: PBEPBE/SDD
title: #p freq=noraman PBEPBE/SDD
converged: YES YES NO NO
title: Mulliken charges:
elementType: O O C C C C C C C C C C C C C C C C H H H H H H H H H H H H H H
charge: -0.200268 -0.200228 0.220921 0.220843 0.320042 0.320094 -0.020576 -0.020534 -0.311396 -0.311329 -0.405326 -0.405336 -0.788348 -0.788332 -0.263668 -0.263697 -0.218807 -0.218808 0.249230 0.249278 0.236808 0.236803 0.250982 0.211048 0.250634 0.250637 0.250975 0.211052 0.235339 0.235342 0.233310 0.233314
chargesum: 0.00000
title: Mulliken charges with hydrogens summed into heavy atoms:
elementType: O O C C C C C C C C C C C C C C C C
charge: -0.200268 -0.200228 0.220921 0.220843 0.320042 0.320094 -0.020576 -0.020534 -0.062166 -0.062051 -0.168518 -0.168533 -0.075684 -0.075667 -0.028329 -0.028355 0.014503 0.014505
polarizability: 2.51759317e+02 -2.53266610e+00 1.65347793e+02 -2.03567253e-02 2.15647990e-03 1.31198673e+02
1716.lowfreq: -0.0002 0.0003 0.0004 1.3796 6.1699 7.9605 22.3438 29.0373 31.2953
frequency: 22.3437 29.0263 31.1723 109.4363 121.0344 141.4276 150.5692 195.5990 201.8688 211.3087 223.3871 227.9256 285.4149 322.4033 379.4625 400.1819 402.4139 429.4509 436.3348 439.7283 493.8199 497.3675 553.9433 554.0468 643.3093 664.8304 697.2522 699.1107 727.0611 734.2176 750.5544 784.4861 798.3258 816.9683 863.4672 876.1606 878.9211 957.8039 958.1185 992.2323 994.5098 998.0402 998.2090 1007.9371 1042.6668 1042.7159 1052.6346 1053.7488 1127.0060 1142.3254 1180.7571 1181.1301 1203.3664 1214.5602 1215.7745 1280.5652 1287.4382 1288.4118 1373.3022 1376.4256 1405.1407 1405.1711 1425.8839 1426.5640 1453.3139 1453.3756 1467.3286 1467.3396 1474.4703 1475.8798 1535.2118 1543.9130 1578.5680 1580.0794 1610.3524 1610.5591 2989.5754 2989.6241 3073.6695 3073.6914 3089.8319 3090.1030 3125.2415 3125.2954 3140.7441 3140.8237 3152.7465 3153.1587 3169.9748 3170.2115
redmass: 6.2873 3.6153 4.6198 5.6001 4.2233 3.7107 5.9064 1.4132 1.1948 2.5769 2.7790 2.8307 7.1655 9.3700 2.9815 5.5542 5.3362 3.1833 3.3213 3.2563 3.2780 3.5630 5.9985 5.9032 7.0642 5.8254 5.0757 4.4368 2.7874 1.7079 1.6084 2.5673 3.6906 3.8885 2.9916 1.3128 1.6531 1.3928 1.4073 1.5199 1.6010 1.3730 1.3506 6.5499 1.5926 1.5950 2.2603 2.2202 1.8134 1.6352 1.0768 1.0833 3.5323 2.6365 2.5245 4.5903 1.4563 1.4481 5.4912 5.6594 1.2968 1.3008 1.8302 1.8297 1.0556 1.0546 1.2438 1.2110 2.6404 2.5522 7.0295 8.8091 6.6968 6.9773 5.9764 5.9366 1.0365 1.0365 1.0955 1.0955 1.1014 1.1014 1.0866 1.0866 1.0895 1.0896 1.0939 1.0938 1.1001 1.1000
irintensity: 2.1675 0.1628 1.5070 0.2667 1.1235 0.4612 0.8923 1.7843 1.2291 0.2074 1.4103 0.7225 30.1567 2.8517 4.6575 0.7526 0.5031 0.2714 6.6366 5.4103 3.0865 2.4858 0.0117 0.4048 103.7768 2.1953 3.2536 16.0423 39.5747 61.9455 39.0247 23.9608 5.4175 5.3618 77.3429 0.0466 12.3937 0.0031 0.0694 0.0598 4.9436 0.2442 0.5490 0.0128 11.6873 7.6617 5.7292 2.9501 26.6469 0.6375 8.4555 0.0423 138.8588 0.3133 115.2913 12.2806 1.7086 6.1591 21.4190 14.0947 26.3048 12.3945 0.6756 3.6676 14.5967 16.5578 5.3058 41.8559 0.3130 64.5444 99.3959 301.3084 29.0625 10.0578 19.1691 41.0017 28.8367 5.7937 12.0845 5.9095 68.2142 0.3707 10.5004 2.1287 19.9671 1.4375 51.4657 1.8883 23.4422 14.1351
temp: 298.150 k
press: 1.00000 atm
elementType: 8 8 6 6 6 6 6 6 6 6 6 6 6 6 6 6 6 6 1 1 1 1 1 1 1 1 1 1 1 1 1 1
symmnumber: 1
zpe: 658914.2 jmol-1
zpe.correction: 0.250967 hartree
zpe.thermalcorrener: 0.267171 hartree
zpe.thermalcorrenthalpy: 0.268115 hartree
zpe.thermalcorrgfe: 0.205791 hartree
zpe.sumelectzpe: -767.285441 hartree
zpe.sumelectthermal: -767.269237 hartree
zpe.sumelectthermalent: -767.268293 hartree
zpe.sumelectthermalfe: -767.330617 hartree
dipole: -0.0007 -0.0016 3.2616
dipole: 3.2616
quadrupole: -79.7491 -104.6685 -107.2872
quadrupole: 0.6361 -0.0023 -0.0020
quadrupole: 17.4858 -7.4336 -10.0522 0.6361 -0.0023 -0.0020
hfenergy: -767.5364081 hartree
pointgroup: C01 [X(C16H14O2)]
dipole: -0.0002131 -1.2831769 -0.0097461 debye
polarizability: 251.6192599|0.0587211|131.2004508|-4.3005063|-0.2466654|165.4860723 unknown
InChI: InChI=1S/C16H14O2/c1-11-7-3-5-9-13(11)15(17)16(18)14-10-6-4-8-12(14)2/h3-10H,1-2H3
charge 0 multiplicity 1
32 atoms
O  0.551592 1.162538 1.557448
O  -0.54992 1.186158 -1.53719
C  1.885111 -0.069329 -0.079783
C  -1.883731 -0.070246 0.081135
C  3.154864 0.107663 0.573312
C  -3.153323 0.115652 -0.569849
C  0.63921 0.547008 0.449053
C  -0.637738 0.553924 -0.438234
C  1.796433 -0.895644 -1.238634
C  -1.795259 -0.913146 1.228015
C  4.278276 -0.562205 0.026716
C  -4.27668 -0.562538 -0.033489
C  3.34886 0.976791 1.800018
C  -3.347321 1.002351 -1.783897
C  2.925644 -1.555572 -1.754572
C  -2.924421 -1.580881 1.733897
C  4.175643 -1.386186 -1.115622
C  -4.174205 -1.402872 1.096886
H  0.831932 -1.0117 -1.742197
H  -0.830958 -1.036082 1.730324
H  5.253224 -0.431221 0.510509
H  -5.251466 -0.42497 -0.515783
H  2.775966 0.593335 2.66276
H  4.417807 1.023872 2.071222
H  2.973421 2.002238 1.637143
H  -2.972992 2.02567 -1.605804
H  -2.773423 0.63207 -2.65171
H  -4.416128 1.052334 -2.055138
H  2.837697 -2.186891 -2.644709
H  -2.836596 -2.224884 2.614911
H  5.067243 -1.888987 -1.507026
H  -5.065763 -1.91165 1.480586
