program: Gaussian 09
title: 000272132
version: EM64L-G09RevD.01
frameworkgroup: C1[X(C19H24N2O2)]
method: RPBEPBE
basis: SDD
operation: Freq
keyword: #p
keyword: freq=noraman
keyword: PBEPBE/SDD
title: #p freq=noraman PBEPBE/SDD
converged: YES YES NO NO
title: Mulliken charges:
elementType: O O N N C C C C C C C C C C C C C C C C C C C H H H H H H H H H H H H H H H H H H H H H H H H
charge: -0.463759 -0.297860 -0.090380 -0.015659 0.027234 -0.433962 -0.448572 -0.472175 -0.419012 -0.415459 -0.072130 -0.612823 0.229784 0.406362 0.237034 -0.795412 -0.377248 -0.074750 -0.383366 -0.378887 -0.309745 -0.263056 -0.223574 0.251052 0.205566 0.201797 0.204530 0.215044 0.212306 0.205475 0.216153 0.232199 0.266281 0.210657 0.228642 0.222234 0.234198 0.354827 0.234104 0.229974 0.266459 0.251064 0.234541 0.240442 0.263637 0.231240 0.234992
chargesum: 0.00000
title: Mulliken charges with hydrogens summed into heavy atoms:
elementType: O O N N C C C C C C C C C C C C C C C C C C C
charge: -0.108932 -0.297860 -0.090380 -0.015659 0.278286 -0.026599 -0.028998 -0.054394 0.029340 0.061479 0.156512 -0.156391 0.229784 0.406362 0.237034 -0.064875 -0.126184 -0.074750 -0.148825 -0.138445 -0.046108 -0.031817 0.011418
polarizability: 2.69213844e+02 -2.11710470e+00 2.53814185e+02 3.19517906e+01 8.35296361e+00 1.52743804e+02
1716.lowfreq: -17.8100 -0.0009 -0.0008 -0.0002 1.7235 3.7659 11.0278 18.2775 27.9044
frequency: -12.1619 18.1587 27.8290 42.2956 62.5463 75.7707 84.0977 103.9965 140.9973 167.4191 171.4879 178.5479 184.7485 193.3811 251.9241 277.7125 301.1840 315.4006 339.4828 350.2428 370.7955 416.8899 423.1484 441.4336 448.5511 452.6924 461.4790 471.0065 499.8294 506.5728 514.5950 543.8556 564.7801 572.0675 602.7427 613.8275 660.4988 697.7555 705.7665 770.8116 782.9018 796.5993 804.0546 807.2124 827.4648 849.7881 862.9914 877.9761 887.8927 912.9217 944.8165 960.3185 961.6212 967.8954 969.4200 992.6436 998.7385 999.2064 1013.3396 1020.7282 1026.6527 1039.6265 1046.4952 1059.4056 1077.9581 1094.5427 1109.8717 1128.5577 1143.1747 1155.7227 1159.6365 1174.5245 1192.4163 1199.7185 1218.7011 1234.1809 1243.2559 1252.6894 1257.1187 1264.5165 1270.0377 1273.9933 1295.3042 1315.1515 1324.3411 1336.9995 1338.4818 1343.3884 1350.7729 1356.0478 1368.2116 1371.6143 1379.2256 1386.2399 1387.8828 1422.2525 1430.5831 1441.8513 1449.3194 1450.2809 1452.3132 1458.1846 1466.7576 1467.6075 1471.1164 1481.4437 1510.0009 1552.8682 1581.5947 1590.4187 1621.0785 2945.8945 2952.6129 2956.7624 2961.6467 2966.6329 2972.8306 2986.7837 2987.7504 2998.9919 3023.8598 3033.9087 3045.4857 3060.6847 3073.7173 3084.8392 3090.7697 3120.8749 3129.7576 3130.1355 3142.8279 3149.2738 3158.3117 3173.3694 3535.9109
redmass: 3.6551 5.8061 4.5584 5.5634 5.7169 3.6627 4.9214 3.3888 4.0329 1.5680 3.2323 4.3287 1.5477 4.1733 4.9247 2.5359 2.8766 2.8479 1.7731 1.3170 3.0888 3.3193 2.1771 3.4951 2.4026 2.3737 3.1295 3.0987 3.9356 4.3943 5.8207 4.1738 3.5757 4.3311 2.7288 3.4811 3.7133 3.1849 4.1980 1.4157 2.5477 3.0402 1.5450 5.5251 2.6474 3.0994 1.6456 1.6471 1.7444 2.2781 2.5591 1.8803 1.4332 1.3973 1.7085 2.3592 1.3400 2.1646 2.5658 2.4921 1.6744 2.4318 2.5205 2.0675 2.6261 2.1525 1.7530 2.5377 1.4068 1.5175 1.3150 1.2244 1.8685 1.3931 1.9458 1.4911 1.4507 1.4102 1.4773 1.5358 1.6657 1.5344 1.2590 1.3132 1.3445 1.4272 1.2832 2.4089 1.5099 1.4389 1.4172 1.2194 2.2884 1.8505 2.0599 3.0069 2.6966 1.0991 1.0966 1.0900 2.6563 1.0929 1.0870 1.1270 1.0948 1.0685 3.6779 6.7278 6.6766 6.3617 6.3530 1.0714 1.0828 1.0697 1.0597 1.0612 1.0650 1.0773 1.0381 1.0597 1.1015 1.1005 1.1003 1.1019 1.0984 1.0931 1.0910 1.0886 1.0979 1.0852 1.0897 1.0957 1.0956 1.0994 1.0658
irintensity: 1.4852 1.2128 0.4662 0.0318 1.6944 1.9425 2.9292 2.1008 0.1704 1.7624 0.8003 8.5373 2.7133 0.7587 1.4025 2.0878 1.0433 11.1777 29.8950 80.2840 45.7504 3.4672 1.1982 8.3466 0.9238 13.4284 1.4078 1.1423 3.6619 2.6470 1.6460 2.4601 7.8457 5.8356 1.0965 2.4957 2.4571 1.9397 2.5147 63.6720 14.0759 0.7105 0.8468 1.0832 33.2193 5.8811 8.4375 2.7448 10.1183 4.1580 3.7542 28.4041 0.7938 3.4702 38.5131 13.5536 0.5121 1.6751 9.5684 11.1675 3.2739 28.3601 17.3910 17.3780 3.7867 18.5795 0.4794 16.8282 3.9570 2.8593 9.1513 3.6717 2.0021 21.5164 2.5421 62.8770 16.7317 1.6565 19.1240 14.7600 45.8786 41.1779 6.6855 4.4941 13.7358 12.1718 4.2455 11.5327 3.2640 4.1276 10.6346 30.9593 3.0006 29.3518 3.5489 157.2022 9.8032 1.1793 19.8636 22.8654 2.8960 13.0523 16.0317 22.1743 18.9355 5.0251 28.1260 13.7713 34.9550 284.7779 3.2720 37.8792 19.2073 47.2559 8.7665 37.8628 25.1830 27.0616 9.5086 28.4637 3.4937 62.1427 64.7246 25.4922 18.6199 8.0272 24.5971 20.2991 11.2651 0.3512 14.4445 22.3309 21.7007 17.9301 1.5578
temp: 298.150 k
press: 1.00000 atm
elementType: 8 8 7 7 6 6 6 6 6 6 6 6 6 6 6 6 6 6 6 6 6 6 6 1 1 1 1 1 1 1 1 1 1 1 1 1 1 1 1 1 1 1 1 1 1 1 1
symmnumber: 1
zpe: 1034606.0 jmol-1
zpe.correction: 0.394061 hartree
zpe.thermalcorrener: 0.414634 hartree
zpe.thermalcorrenthalpy: 0.415578 hartree
zpe.thermalcorrgfe: 0.343475 hartree
zpe.sumelectzpe: -996.682430 hartree
zpe.sumelectthermal: -996.661857 hartree
zpe.sumelectthermalent: -996.660913 hartree
zpe.sumelectthermalfe: -996.733016 hartree
dipole: -0.4377 -3.0271 2.7084
dipole: 4.0854
quadrupole: -160.2365 -137.0704 -137.4481
quadrupole: -25.5452 6.2390 2.8458
quadrupole: -15.3182 7.8479 7.4703 -25.5452 6.2390 2.8458
hfenergy: -997.0764907 hartree
pointgroup: C01 [X(C19H24N2O2)]
dipole: -0.1834302 1.1129673 -1.1450455 debye
polarizability: 267.8066462|-0.3346098|254.4966127|-34.4469925|1.3788915|153.4685745 unknown
InChI: InChI=1S/C19H24N2O2/c1-14(22)21-10-7-15(8-11-21)12-17(23)13-16-6-9-20-19-5-3-2-4-18(16)19/h2-6,9,15,17,23H,7-8,10-13H2,1H3
charge 0 multiplicity 1
47 atoms
O  -0.275017 1.957988 0.801469
O  5.939186 -2.289986 0.626771
N  4.9352 -0.208623 0.347793
N  -5.295303 0.733842 0.963303
C  2.308148 1.006881 -0.195962
C  3.576134 1.376905 -1.007205
C  2.451127 -0.434383 0.357377
C  1.041867 1.196132 -1.065046
C  4.868179 1.166815 -0.182192
C  3.761869 -0.6090 1.155553
C  -0.282128 0.992741 -0.312317
C  -1.511107 1.228739 -1.243251
C  5.975286 -1.112554 0.143866
C  -2.830106 1.028642 -0.522542
C  -3.398995 -0.284915 -0.309507
C  7.17278 -0.641121 -0.686063
C  -3.515889 2.127722 0.015493
C  -4.639097 -0.378035 0.440701
C  -2.807064 -1.496271 -0.799401
C  -4.733075 1.93628 0.743262
C  -5.234104 -1.660019 0.667315
C  -3.409599 -2.73504 -0.563838
C  -4.631205 -2.819647 0.175655
H  2.225079 1.698956 0.667029
H  3.524025 2.434587 -1.333567
H  3.625841 0.749145 -1.920723
H  2.439074 -1.159994 -0.481669
H  1.602704 -0.680337 1.023546
H  1.040919 2.222933 -1.484479
H  1.071217 0.491629 -1.922375
H  4.876121 1.882519 0.668628
H  5.755571 1.376674 -0.798776
H  3.919128 -1.656245 1.460178
H  3.725455 0.020419 2.070251
H  -0.338289 -0.04071 0.093437
H  -1.424561 0.554751 -2.115983
H  -1.447683 2.266062 -1.620406
H  -1.124406 1.871761 1.307095
H  7.669571 0.238147 -0.236833
H  6.88362 -0.380634 -1.720846
H  7.891235 -1.4730 -0.721125
H  -3.133629 3.143029 -0.135049
H  -1.875127 -1.452813 -1.372843
H  -5.263426 2.801449 1.159464
H  -6.169012 -1.686254 1.235318
H  -2.945677 -3.650384 -0.947354
H  -5.091639 -3.797685 0.352552
