program: Gaussian 09
title: 000272097
version: EM64L-G09RevD.01
frameworkgroup: C1[X(C14H25N5O2)]
method: RPBEPBE
basis: SDD
operation: Freq
keyword: #p
keyword: freq=noraman
keyword: PBEPBE/SDD
title: #p freq=noraman PBEPBE/SDD
converged: YES YES NO NO
title: Mulliken charges:
elementType: O O N N N N N C C C C C C C C C C C C C C H H H H H H H H H H H H H H H H H H H H H H H H H
charge: -0.282075 -0.279975 -0.112325 -0.391311 -0.079371 0.034334 -0.656436 -0.426404 -0.391249 0.002803 -0.371878 -0.320894 -0.315516 -0.717595 0.136441 -0.685890 -0.675592 0.101236 0.397784 -0.346180 -0.328017 0.193468 0.229816 0.209309 0.199743 0.238081 0.192047 0.198606 0.180820 0.206958 0.183360 0.204961 0.209706 0.247669 0.211362 0.358298 0.260766 0.198962 0.204316 0.225075 0.204768 0.206304 0.224338 0.238179 0.311989 0.369211
chargesum: 0.00000
title: Mulliken charges with hydrogens summed into heavy atoms:
elementType: O O N N N N N C C C C C C C C C C C C C C
charge: -0.282075 -0.279975 -0.112325 -0.033013 -0.079371 0.034334 0.024764 -0.003121 0.017804 0.240884 0.018775 0.066884 0.072805 -0.048858 0.136441 -0.021847 -0.039445 0.101236 0.397784 -0.121842 -0.089837
polarizability: 2.66886566e+02 -1.82257006e+01 2.31449182e+02 2.40247188e+01 9.22742823e+00 1.38909989e+02
1716.lowfreq: -10.2760 -4.9845 0.0005 0.0005 0.0008 1.6109 13.4777 20.0125 33.9281
frequency: 12.5186 19.7268 33.9161 43.8141 65.0667 76.0528 83.0684 93.6326 103.6586 115.1460 147.3671 152.7947 192.1383 192.5975 203.1115 228.6808 238.4464 250.8562 281.6123 289.8930 308.8943 323.2485 348.9902 375.9751 390.4476 408.9112 418.5126 435.2387 459.6710 468.1441 487.4670 519.1403 520.5060 530.6634 553.5897 636.0075 669.9825 685.4101 694.6177 740.0169 757.4249 763.7160 771.1351 787.2803 793.1640 798.0884 803.5169 833.9637 841.0246 877.2016 913.5578 926.3018 946.5398 952.8327 989.5564 1006.7398 1013.5580 1036.6961 1049.3195 1072.9813 1082.4121 1085.4004 1086.8649 1100.4185 1118.3367 1121.7870 1131.5639 1139.1251 1176.6449 1196.3282 1203.8109 1215.3243 1225.1111 1251.6239 1268.7837 1280.8073 1283.4203 1290.4702 1294.8809 1316.6083 1344.8685 1349.5596 1353.3135 1358.4226 1360.9228 1373.3362 1380.0734 1382.5842 1383.9566 1395.9584 1407.5384 1454.5652 1460.1223 1464.4790 1465.6473 1470.2806 1473.7064 1477.6625 1479.9775 1480.8271 1487.5534 1489.4327 1490.9129 1525.0662 1562.3559 1564.1834 1595.6849 2843.2503 2850.2001 2867.5015 2970.5981 2976.1598 2980.4205 2981.9600 2985.2144 3011.2454 3020.2879 3026.4437 3030.7875 3033.7935 3046.1482 3072.1498 3073.9007 3079.7388 3088.0172 3095.6870 3100.7580 3125.0693 3161.7910 3342.1334 3374.6853 3636.6809
redmass: 4.0666 4.4535 5.4918 3.3274 4.0568 3.6951 1.9300 6.3764 2.6168 4.4940 2.2270 3.0618 1.3008 4.5775 1.3087 1.3658 1.9349 4.3345 2.0206 2.0468 2.8861 2.7558 5.6687 3.8513 4.4798 3.6472 3.7228 2.6051 2.5538 3.2757 3.0632 6.4081 1.2285 3.0253 4.2020 3.8564 11.1969 5.4274 2.3204 1.9349 1.2597 4.0917 2.1264 1.6012 1.1715 1.1886 1.3073 4.0935 2.1074 2.4324 1.9349 1.6758 1.8845 1.4123 1.7467 4.1638 2.3321 2.1962 2.0829 1.9041 2.4626 1.8582 2.5702 2.3545 2.0109 1.9842 1.6797 1.8534 2.2981 2.3600 2.8708 2.9323 2.8377 1.4574 2.0884 1.1855 1.4831 1.2732 1.1924 1.5132 1.3388 1.6809 1.4759 1.3383 1.3462 1.3645 1.2512 2.3809 1.2499 1.2213 2.7179 1.0857 1.0617 1.0699 1.0550 1.0910 1.0818 1.0699 1.0508 1.0582 1.1440 1.2454 2.0811 2.2985 2.3402 3.0534 3.2501 1.0722 1.0717 1.0709 1.0599 1.0597 1.0356 1.0362 1.0367 1.0940 1.0875 1.0874 1.0907 1.0876 1.1010 1.0984 1.0977 1.0995 1.1002 1.1002 1.0997 1.0890 1.0963 1.0786 1.0568 1.0940
irintensity: 0.1078 1.0043 0.3592 0.6866 1.1992 0.9108 0.3182 3.8537 0.2918 0.8538 1.0006 0.5992 1.3874 0.6677 0.1495 0.2810 1.1651 2.2148 1.7163 1.2601 3.2200 3.8319 3.2955 7.6326 11.8511 3.2305 3.9583 1.6553 4.3440 2.3833 3.1940 5.0547 136.0029 1.3659 2.2989 6.8979 1.0809 6.3562 7.4674 98.0789 20.4449 10.1398 55.3838 133.2437 7.6002 4.0218 1.8924 1.7103 1.5290 4.0645 0.6725 1.3383 7.4066 0.1206 13.5120 32.5883 6.1963 18.6347 13.7027 16.6797 8.5909 3.4372 23.9718 18.0101 4.1987 9.8348 24.8906 45.2670 18.9697 106.3071 57.1066 172.1903 68.9583 22.8457 0.6831 5.6228 10.3289 7.0214 31.8841 30.3103 66.7454 72.4806 5.4322 7.8661 1.7963 4.6897 19.1795 80.5847 14.7756 20.9371 24.1971 1.4468 3.1383 2.1218 7.3888 23.4783 4.0904 4.6381 15.3015 5.0820 47.8812 30.6888 42.2509 82.7647 178.6035 284.4638 647.5808 33.2243 94.5989 240.2940 5.1342 43.9578 24.3057 51.0382 28.5231 8.1446 1.9960 12.6814 21.5043 14.2479 78.0858 30.1630 94.6517 48.9792 44.6719 26.0339 31.2015 21.4342 20.9598 50.2904 100.1084 72.8725
temp: 298.150 k
press: 1.00000 atm
elementType: 8 8 7 7 7 7 7 6 6 6 6 6 6 6 6 6 6 6 6 6 6 1 1 1 1 1 1 1 1 1 1 1 1 1 1 1 1 1 1 1 1 1 1 1 1 1
symmnumber: 1
zpe: 1019286.9 jmol-1
zpe.correction: 0.388226 hartree
zpe.thermalcorrener: 0.411029 hartree
zpe.thermalcorrenthalpy: 0.411973 hartree
zpe.thermalcorrgfe: 0.333982 hartree
zpe.sumelectzpe: -970.981260 hartree
zpe.sumelectthermal: -970.958457 hartree
zpe.sumelectthermalent: -970.957513 hartree
zpe.sumelectthermalfe: -971.035505 hartree
dipole: -1.9814 -1.6321 -1.8243
dipole: 3.1492
quadrupole: -95.2229 -133.7660 -130.1810
quadrupole: -4.8019 3.9178 -3.9339
quadrupole: 24.5004 -14.0427 -10.4577 -4.8019 3.9178 -3.9339
hfenergy: -971.3694861 hartree
pointgroup: C01 [X(C14H25N5O2)]
dipole: 0.8273872 -0.581892 0.7155181 debye
polarizability: 267.6625397|19.8079652|231.2243944|17.7300699|-14.4504242|138.3588028 unknown
InChI: InChI=1S/C14H25N5O2/c1-4-18(5-2)10-6-7-11(3)17-14-13(19(20)21)12(15)8-9-16-14/h8-9,11,17H,4-7,10,15H2,1-3H3
charge 0 multiplicity 1
46 atoms
O  2.184719 2.912014 -1.046248
O  0.31655 1.627732 -1.150471
N  -3.77374 0.482487 0.458248
N  0.369266 -0.882119 -0.448977
N  2.394735 -1.769454 0.285571
N  1.596715 1.746683 -0.87174
N  4.434482 1.926937 -0.23857
C  -1.823672 -1.892018 0.002838
C  -2.100635 -1.183366 1.3465
C  -0.327358 -2.177442 -0.262126
C  -3.540851 -0.625599 1.425007
C  -3.263663 1.787952 0.968566
C  -5.188229 0.565729 0.002485
C  -0.111612 -3.089108 -1.493422
C  1.692339 -0.683551 -0.185945
C  -2.921551 2.791358 -0.148894
C  -5.558973 -0.524449 -1.021321
C  2.335055 0.6220 -0.386306
C  3.750485 0.750033 -0.078996
C  4.425735 -0.407305 0.407562
C  3.712341 -1.603421 0.568505
H  -2.367311 -2.856891 -0.029469
H  -2.237284 -1.264948 -0.813322
H  -1.377672 -0.355661 1.485586
H  -1.93751 -1.886878 2.188424
H  0.135207 -2.666622 0.614856
H  -4.248543 -1.444242 1.193762
H  -3.762219 -0.302816 2.47335
H  -3.99264 2.246632 1.685567
H  -2.343933 1.586896 1.548342
H  -5.898111 0.528788 0.86895
H  -5.329755 1.552953 -0.473431
H  -0.547701 -2.635394 -2.402389
H  0.965774 -3.257995 -1.659357
H  -0.595576 -4.069497 -1.329522
H  -0.140224 -0.062519 -0.817841
H  -2.114673 2.398113 -0.789656
H  -3.796712 3.0136 -0.786366
H  -2.576942 3.747074 0.289063
H  -4.902549 -0.452049 -1.906199
H  -5.452398 -1.541221 -0.600979
H  -6.609159 -0.406268 -1.348424
H  5.490606 -0.356379 0.65279
H  4.224497 -2.496158 0.947165
H  5.425219 1.969614 -0.010266
H  3.909274 2.739376 -0.588598
