program: Gaussian 09
title: 000272101
version: EM64L-G09RevD.01
frameworkgroup: C1[X(C18H14N2O6S)]
method: RPBEPBE
basis: SDD
operation: Freq
keyword: #p
keyword: freq=noraman
keyword: PBEPBE/SDD
title: #p freq=noraman PBEPBE/SDD
converged: YES YES NO NO
title: Mulliken charges:
elementType: S O O O O O O N N C C C C C C C C C C C C C C C C C C H H H H H H H H H H H H H H
charge: 0.910027 -0.190934 -0.481237 -0.483106 -0.224855 -0.182904 -0.186483 -0.434601 -0.182179 -0.373918 -0.114126 0.286924 -0.388818 0.245171 -0.268039 -0.248506 -0.320509 -0.205736 -0.202141 0.175089 0.179852 0.122269 0.122966 -0.346096 -0.346432 -0.210618 -0.210701 0.269952 0.241098 0.234623 0.258917 0.256498 0.225676 0.274514 0.283469 0.251155 0.247531 0.268893 0.269362 0.238877 0.239075
chargesum: 0.00000
title: Mulliken charges with hydrogens summed into heavy atoms:
elementType: S O O O O O O N N C C C C C C C C C C C C C C C C C C
charge: 0.910027 -0.190934 -0.481237 -0.483106 -0.224855 -0.182904 -0.186483 -0.434601 -0.182179 0.137133 -0.114126 0.286924 0.104721 0.245171 0.214135 0.026008 -0.037039 0.045419 0.045390 0.175089 0.179852 0.122269 0.122966 -0.077203 -0.077070 0.028259 0.028374
polarizability: 2.88987398e+02 -4.86642367e+00 2.54623795e+02 5.44536129e+01 -1.04242345e+01 2.15074629e+02
1716.lowfreq: -3.6315 -0.0013 -0.0011 -0.0005 1.8437 4.8928 10.9829 14.7077 20.8619
frequency: 10.7072 14.4872 20.7565 29.4247 47.5635 63.3526 90.6779 93.3809 101.7256 121.9262 138.2108 141.0037 156.9597 178.9495 187.2814 203.4263 229.7455 233.4895 247.0891 283.3636 289.9851 295.7646 306.2772 325.9362 355.5366 399.5365 413.1619 417.2786 421.4421 444.2176 454.6983 489.3263 498.5726 511.4637 524.4101 531.7739 590.8888 643.7678 656.4303 657.6940 678.0223 687.4064 688.4561 695.9229 740.1722 770.2045 780.5666 782.7396 789.8070 802.1285 835.4502 852.4122 881.5936 890.5928 898.4293 907.1044 912.2562 943.3186 952.7492 970.8919 973.6336 1002.2893 1006.2082 1010.4033 1011.6739 1015.2552 1036.5776 1057.2306 1084.2325 1101.3658 1106.6548 1114.1156 1164.9756 1167.8056 1168.1008 1176.8819 1194.3465 1195.6034 1258.6744 1264.1938 1273.1270 1280.2621 1283.6663 1311.6943 1335.1328 1345.8365 1393.9378 1397.0063 1414.9269 1431.6286 1446.9928 1452.2723 1452.9021 1453.3280 1467.3222 1479.1711 1580.1816 1601.2983 1612.0399 1616.6014 1619.3059 1644.7510 1685.6105 2995.6586 3001.3678 3012.2540 3056.5929 3067.7979 3091.3501 3139.8162 3148.7957 3153.5914 3160.1790 3165.4702 3170.4082 3175.0818 3181.0290
redmass: 7.2600 7.6183 8.6823 8.2277 7.3359 8.4971 4.8245 4.7489 3.5021 4.7591 5.0012 5.9622 8.0424 6.4514 5.9850 4.8063 3.8946 6.1309 7.8554 10.1182 7.9821 4.4836 7.8488 7.8587 6.2928 3.3240 4.4559 4.7437 6.2597 13.5970 4.9011 4.4823 5.4844 7.4680 4.2119 6.2731 11.8090 6.2355 4.7151 4.8202 6.3296 4.4077 7.7087 5.4932 3.1815 2.4849 5.3724 1.4835 1.4848 1.6640 9.0394 7.8421 3.5207 1.3514 3.3230 1.3893 3.5715 9.3147 18.9887 1.3907 1.4087 5.8150 1.3454 1.4269 2.1916 2.0711 2.3192 4.2965 4.7925 2.2258 2.3851 1.7275 1.3837 1.6113 1.6655 1.1417 2.3417 1.9052 1.5729 1.8713 2.0147 1.4044 1.4951 2.6912 1.3886 1.3131 1.4928 7.2457 6.1712 2.2484 1.5500 1.5259 2.6963 2.4694 1.0944 1.0923 6.8183 8.8783 7.5726 8.7548 7.6085 12.7452 12.6965 1.0597 1.0580 1.0613 1.1022 1.1037 1.1071 1.0864 1.0869 1.0906 1.0906 1.0955 1.0958 1.1003 1.1008
irintensity: 0.7846 0.5256 0.8458 0.9804 2.8712 3.4188 0.6308 1.2084 1.5029 5.5932 0.0174 0.8532 0.9022 6.3502 3.7706 2.1613 3.0982 1.6638 3.7648 3.3356 25.2842 3.7986 0.4238 9.3498 4.0165 1.9204 3.0799 29.0262 46.4774 22.9769 0.0125 4.7867 9.3873 10.0802 2.6671 3.3206 2.9380 1.8530 20.5265 0.0118 14.6217 45.3550 4.8875 36.3734 26.2713 3.7242 0.0235 47.8214 43.1776 12.4026 97.1906 33.0621 3.5632 1.5286 13.9313 0.0108 3.0412 215.2503 51.9665 0.8639 2.1949 3.1468 0.0018 1.0092 2.9117 1.3031 13.4562 67.3876 18.2211 2.7666 5.5409 13.0362 27.1565 0.4579 1.5045 6.7579 25.1046 5.2371 25.7332 75.1510 65.9663 10.0660 0.9377 196.9087 55.7858 5.1537 14.8031 3.8678 9.6708 15.4760 30.0108 18.7117 3.1475 11.0567 5.3468 11.1125 20.6762 96.3209 2.8331 75.2602 23.2892 425.3903 35.3971 8.9514 14.8192 17.5775 3.6175 0.2836 21.5946 1.8657 2.7141 5.8177 1.8086 5.4765 0.6609 21.4942 13.6233
temp: 298.150 k
press: 1.00000 atm
elementType: 16 8 8 8 8 8 8 7 7 6 6 6 6 6 6 6 6 6 6 6 6 6 6 6 6 6 6 1 1 1 1 1 1 1 1 1 1 1 1 1 1
symmnumber: 1
zpe: 762562.6 jmol-1
zpe.correction: 0.290445 hartree
zpe.thermalcorrener: 0.314664 hartree
zpe.thermalcorrenthalpy: 0.315608 hartree
zpe.thermalcorrgfe: 0.232494 hartree
zpe.sumelectzpe: -1651.112371 hartree
zpe.sumelectthermal: -1651.088151 hartree
zpe.sumelectthermalent: -1651.087207 hartree
zpe.sumelectthermalfe: -1651.170322 hartree
dipole: -1.9131 5.4921 0.5566
dipole: 5.8423
quadrupole: -113.6813 -150.6622 -179.7147
quadrupole: -4.0396 8.5211 1.7654
quadrupole: 34.3381 -2.6428 -31.6953 -4.0396 8.5211 1.7654
hfenergy: -1651.4028155 hartree
pointgroup: C01 [X(C18H14N2O6S1)]
dipole: 0.7513965 -2.155151 0.2720522 debye
polarizability: 287.2937438|-6.4335405|255.2440375|-55.3631243|9.4618499|216.1480407 unknown
InChI: InChI=1S/C18H14N2O6S/c21-16-14-8-3-4-9-15(14)27(24,25)19(16)10-5-11-26-20-17(22)12-6-1-2-7-13(12)18(20)23/h1-4,6-9H,5,10-11H2
charge 0 multiplicity 1
41 atoms
S  2.680843 0.20287 1.543969
O  -1.666306 1.702163 -0.953749
O  3.265805 1.049266 2.79654
O  1.260103 -0.557329 1.733069
O  3.736624 1.539365 -2.067175
O  -2.152378 -1.037103 -1.907262
O  -3.723495 2.304217 1.066267
N  2.65844 1.312061 0.000988
N  -2.675995 0.824225 -0.494666
C  1.922689 2.587583 0.009944
C  3.950104 -0.885953 0.675961
C  4.243052 -0.367081 -0.59654
C  0.576888 2.528289 -0.746527
C  3.546939 0.903549 -0.991916
C  -0.449293 1.620582 -0.068169
C  4.506414 -2.053329 1.204072
C  5.166797 -1.058146 -1.406869
C  5.434559 -2.737122 0.376795
C  5.758245 -2.243218 -0.911229
C  -4.138045 -0.959514 -0.396178
C  -4.60944 0.039625 0.493888
C  -2.883054 -0.47656 -1.061314
C  -3.682453 1.218138 0.44597
C  -4.815289 -2.17732 -0.552573
C  -5.77256 -0.150202 1.254394
C  -5.994981 -2.377376 0.211432
C  -6.466147 -1.379359 1.100977
H  2.577293 3.338009 -0.470725
H  1.78211 2.893957 1.064779
H  0.172551 3.556671 -0.803018
H  0.752463 2.184983 -1.781156
H  -0.115024 0.569549 -0.011329
H  -0.726289 1.9800 0.940781
H  4.246941 -2.426844 2.198698
H  5.401227 -0.659798 -2.399111
H  5.902637 -3.656571 0.742325
H  6.476117 -2.78876 -1.531731
H  -4.440511 -2.940308 -1.241938
H  -6.126129 0.627382 1.938613
H  -6.551183 -3.315805 0.113852
H  -7.379269 -1.561487 1.677663
