program: Gaussian 09
title: 000272092
version: EM64L-G09RevD.01
frameworkgroup: C1[X(C12H14N4O6)]
method: RPBEPBE
basis: SDD
operation: Freq
keyword: #p
keyword: freq=noraman
keyword: PBEPBE/SDD
title: #p freq=noraman PBEPBE/SDD
converged: YES YES NO NO
title: Mulliken charges:
elementType: O O O O O O N N N N C C C C C C C C C C C C H H H H H H H H H H H H H H
charge: -0.283402 -0.494368 -0.502125 -0.445119 -0.289735 -0.307059 -0.196214 -0.389404 -0.003377 -0.647379 -0.019011 -0.160529 -0.185686 -0.043831 -0.391680 0.318895 -0.329278 -0.078257 0.184041 0.047949 0.120569 -0.262062 0.257272 0.294402 0.284286 0.251078 0.242573 0.232817 0.318821 0.398973 0.379342 0.388554 0.358749 0.247358 0.388047 0.314790
chargesum: 0.00000
title: Mulliken charges with hydrogens summed into heavy atoms:
elementType: O O O O O O N N N N C C C C C C C C C C C C
charge: -0.283402 -0.095394 -0.122783 -0.086370 -0.289735 -0.307059 -0.196214 -0.000850 -0.003377 0.055458 0.238261 0.133874 0.098600 0.207246 0.083710 0.318895 -0.010457 -0.078257 0.184041 0.047949 0.120569 -0.014704
polarizability: 2.40261767e+02 6.62407059e-02 1.96543242e+02 1.46041574e+01 -5.72482738e+00 9.69255076e+01
1716.lowfreq: -4.3958 -1.5494 0.0008 0.0009 0.0011 4.6815 18.9904 29.5270 53.3669
frequency: 18.3118 29.4899 53.3661 77.3670 83.6965 100.7522 112.4278 117.5231 170.1416 182.9112 191.1663 196.8392 222.3937 230.5856 250.3161 266.0641 295.7070 303.2654 320.5296 329.3780 358.6947 375.8779 435.5644 457.5270 477.7926 510.8905 527.2021 555.6764 564.0718 582.6834 598.7142 615.3018 626.4140 640.5885 658.2519 682.5973 695.6749 732.7630 733.8387 783.2656 820.1007 832.1410 844.7723 867.6597 890.9353 898.5436 911.0552 918.7509 952.7793 961.2643 971.0941 1002.0558 1014.1889 1038.0636 1038.5808 1053.8703 1091.4881 1096.7293 1118.6274 1130.0132 1147.1559 1149.3102 1169.4405 1221.3389 1224.1502 1242.6666 1265.5664 1275.9942 1301.2466 1314.7100 1322.8118 1325.0721 1347.5463 1348.3565 1364.9456 1366.8491 1378.3055 1387.5848 1395.3105 1412.8984 1470.9489 1509.6975 1536.7570 1548.2091 1572.2105 1589.6587 1601.0172 1657.1558 2960.5549 3016.0115 3026.1136 3052.4820 3076.5305 3088.8942 3135.0842 3140.2537 3237.5774 3274.9958 3401.4757 3594.4527 3601.6149 3618.6837
redmass: 6.5264 6.8363 5.9046 6.3542 4.6568 6.2286 8.2908 5.1524 1.4192 7.1300 7.3807 2.6184 6.8143 5.0113 4.6093 5.4182 1.9242 2.6704 6.7338 4.0572 8.4639 5.1189 5.2175 4.1153 4.8767 3.6904 5.7210 4.9889 2.6191 5.5244 2.5859 1.5316 2.3162 5.0395 3.2883 5.7949 7.4207 4.6223 4.6399 7.9815 3.1696 3.8432 1.6004 1.3059 2.0937 1.0709 1.6414 2.3453 6.0211 5.9931 5.4716 5.1333 3.4214 3.5083 3.3138 1.9034 2.4799 3.1088 4.1606 1.9418 1.4962 1.5235 1.2916 1.3298 2.3092 1.4491 1.3172 1.4054 1.7198 1.3793 1.7258 1.7579 1.3973 2.6255 1.2635 1.7125 1.4324 3.6074 1.3083 3.9048 1.0790 7.5413 6.2663 6.5889 3.6517 3.2150 7.4373 1.2733 1.0843 1.0599 1.0866 1.0878 1.0884 1.1070 1.0770 1.0911 1.0865 1.0985 1.0642 1.0673 1.0844 1.0673
irintensity: 0.4349 0.0785 0.3609 0.7984 17.8949 0.5977 8.8978 11.4717 144.3685 4.6652 6.4660 6.1801 6.8429 6.4772 0.6292 22.9160 83.7474 37.5193 5.5857 8.3343 3.8832 6.4554 4.9198 28.1971 3.9316 1.3201 6.2109 14.9537 40.0592 40.6293 48.9278 63.7984 32.1676 6.2705 27.4192 4.1643 16.8189 37.6764 67.7259 0.5293 11.3440 19.0584 16.8448 114.2634 24.8784 158.9761 8.6867 2.9072 26.2916 45.5590 124.8421 74.1652 39.2421 71.6172 117.4402 33.1521 1.9172 1.5328 35.8662 2.0465 27.0549 42.1361 22.7962 30.4414 63.7509 32.1890 20.5764 18.8606 21.4190 24.0106 14.7529 84.0542 55.3248 16.7239 5.1324 30.3049 9.4956 58.6503 43.5872 0.6311 9.3491 88.3260 131.7880 165.4111 649.8383 146.4614 179.7244 75.4915 27.5310 17.3610 37.1629 7.4316 9.7785 28.8241 466.3201 12.1783 702.1153 17.1084 97.2040 19.5451 67.2738 36.3549
temp: 298.150 k
press: 1.00000 atm
elementType: 8 8 8 8 8 8 7 7 7 7 6 6 6 6 6 6 6 6 6 6 6 6 1 1 1 1 1 1 1 1 1 1 1 1 1 1
symmnumber: 1
zpe: 707531.2 jmol-1
zpe.correction: 0.269484 hartree
zpe.thermalcorrener: 0.289372 hartree
zpe.thermalcorrenthalpy: 0.290316 hartree
zpe.thermalcorrgfe: 0.220017 hartree
zpe.sumelectzpe: -1134.392099 hartree
zpe.sumelectthermal: -1134.372212 hartree
zpe.sumelectthermalent: -1134.371268 hartree
zpe.sumelectthermalfe: -1134.441567 hartree
dipole: -14.4111 -2.8990 -1.1446
dipole: 14.7443
quadrupole: -122.6573 -135.0983 -131.6455
quadrupole: 0.9890 4.0464 6.4424
quadrupole: 7.1431 -5.2979 -1.8451 0.9890 4.0464 6.4424
hfenergy: -1134.6615835 hartree
pointgroup: C01 [X(C12H14N4O6)]
dipole: 5.4890977 -1.8713462 -0.1329896 debye
polarizability: 241.0355097|-5.60467|196.3639073|2.6603842|10.6788071|96.3310996 unknown
InChI: InChI=1S/C12H14N4O6/c13-9(20)4-1-16(10-6(4)11(21)15-3-14-10)12-8(19)7(18)5(2-17)22-12/h1,3,5,7-8,12,14,17-19H,2,13H2
charge 0 multiplicity 1
36 atoms
O  2.474236 0.913274 0.695486
O  1.833338 -2.567325 -0.295551
O  4.165465 -1.866159 0.556137
O  5.322351 1.286861 -1.720401
O  -4.465628 0.066538 -0.077196
O  -1.815265 3.900158 0.82648
N  0.2229 0.199812 0.445101
N  -0.868562 -1.990638 -0.031785
N  -3.269003 -1.940567 -0.27973
N  -3.780208 2.69932 0.43127
C  1.603924 -0.257014 0.66235
C  2.147942 -1.158611 -0.488914
C  3.67416 -0.889421 -0.435433
C  3.778184 0.573465 0.046194
C  4.008019 1.558351 -1.117231
C  -0.870632 -0.623123 0.19637
C  -0.259104 1.512485 0.624962
C  -2.054606 0.149317 0.196086
C  -1.645131 1.521023 0.469407
C  -3.334163 -0.525249 -0.05347
C  -2.419463 2.799932 0.589404
C  -2.110916 -2.575803 -0.265033
H  1.671118 -0.806769 1.62575
H  1.71792 -0.845249 -1.454003
H  4.179994 -1.030967 -1.406496
H  4.573781 0.681374 0.806755
H  3.913562 2.59731 -0.750494
H  3.263157 1.404673 -1.916538
H  0.40789 2.339854 0.842784
H  2.592302 -2.946961 0.235393
H  5.142513 -1.984084 0.480087
H  0.022028 -2.524344 -0.085162
H  6.009391 1.870085 -1.314128
H  -2.090328 -3.655928 -0.448593
H  -4.237482 1.782336 0.234675
H  -4.325284 3.557441 0.511761
