program: Gaussian 09
title: 000272074
version: EM64L-G09RevD.01
frameworkgroup: C1[X(C18H19N)]
method: RPBEPBE
basis: SDD
operation: Freq
keyword: #pfreq=noraman
keyword: PBEPBE/SDD
title: #p freq=noraman PBEPBE/SDD
converged: YES YES NO NO
title: Mulliken charges:
elementType: N C C C C C C C C C C C C C C C C C C H H H H H H H H H H H H H H H H H H H
charge: -0.154504 0.387370 0.129121 0.278901 -0.584295 -0.709868 -0.440601 0.531147 -0.411084 -0.407323 -0.404977 -0.479833 0.400932 -0.246291 -0.241684 -0.361581 -0.357741 -0.647341 -0.647182 0.236767 0.235775 0.220422 0.227720 0.245446 0.242759 0.238593 0.239798 0.219265 0.222358 0.222451 0.233222 0.232253 0.213505 0.231021 0.231182 0.229493 0.213791 0.231014
chargesum: 0.00000
title: Mulliken charges with hydrogens summed into heavy atoms:
elementType: N C C C C C C C C C C C C C C C C C C
charge: -0.154504 0.387370 0.129121 0.278901 -0.111753 -0.261726 -0.195155 0.531147 -0.168325 -0.168729 -0.165180 -0.260569 0.400932 -0.023933 -0.019232 -0.128358 -0.125488 0.028367 0.027116
polarizability: 2.64263631e+02 -1.47757617e+01 1.96942944e+02 -6.15787876e+00 -8.25866422e+00 1.48003973e+02
1716.lowfreq: -10.1861 -0.0002 0.0005 0.0005 2.3185 6.3545 9.2552 28.5898 43.4287
frequency: 6.3033 28.1041 43.3612 73.6854 77.8174 107.8811 140.7419 159.2073 200.4333 207.7272 211.2047 235.5652 261.3704 306.6989 334.2020 375.7312 415.6731 417.1169 436.7614 454.4971 470.6331 508.0586 524.6276 534.7392 563.2945 618.9306 635.4359 690.3212 703.1380 721.8546 731.0703 739.1854 778.9208 783.6051 801.9776 807.1884 825.6700 829.6891 866.7288 905.6185 925.0968 944.6708 945.1947 951.5170 954.6882 981.5028 987.7620 999.0742 1018.8502 1051.6223 1057.9530 1107.6952 1108.5281 1108.9162 1111.7335 1133.7924 1163.2496 1165.1864 1173.2099 1179.3430 1200.7780 1204.1174 1218.0922 1247.9846 1266.5947 1283.2426 1293.7089 1336.3754 1343.9160 1357.3723 1380.7446 1398.6684 1419.6899 1424.3530 1436.9903 1448.7266 1458.5018 1459.3291 1462.6245 1472.1807 1472.9483 1495.6511 1508.4814 1527.3635 1567.0509 1582.4955 1615.1677 1617.4665 1636.0508 2928.8106 2938.1153 2955.5061 2973.8165 2990.9068 2994.2228 3014.9988 3027.4497 3090.0240 3100.0330 3109.4257 3116.8074 3123.5487 3130.4856 3137.7530 3156.5415 3157.5367 3161.0498 3171.9545
redmass: 3.4318 4.3824 4.2235 3.2114 2.4835 2.0499 4.0969 3.3798 3.8650 1.3344 1.5071 2.4402 2.3133 3.0566 3.1279 3.3349 2.9056 2.8979 3.0943 3.0572 3.5108 2.7348 3.4162 5.1446 4.4104 4.6073 6.9131 3.0408 4.6568 2.3216 2.6038 2.4203 2.1748 1.8294 1.8261 1.3409 2.6218 4.6004 1.3565 1.6362 1.6988 2.6462 1.7315 1.4423 1.5851 1.3166 1.7045 3.0440 2.2021 3.7090 1.5089 1.6182 1.2770 1.3139 1.2429 1.4958 1.6279 1.2664 1.1865 1.9674 1.5258 1.4917 1.6579 1.6248 2.9399 1.5699 1.5880 1.4548 3.0842 3.3660 4.8169 3.3762 1.2408 1.8828 1.5146 2.5210 1.3258 2.1302 1.0409 1.1933 1.0484 1.0828 1.0983 2.5514 6.5702 6.2471 7.3595 7.2591 6.1671 1.0371 1.0399 1.0657 1.0609 1.0990 1.1024 1.0981 1.0937 1.0954 1.0934 1.0889 1.0852 1.0893 1.0879 1.0942 1.0929 1.1000 1.0941 1.0960
irintensity: 0.0689 0.1838 1.1472 5.1185 0.2792 0.7107 0.4564 0.2678 2.9300 0.5499 0.7780 0.1987 8.6599 0.3285 5.5350 1.5554 1.0695 5.3645 1.2911 2.5294 3.0493 9.2263 6.1357 1.3776 6.1654 0.6027 0.4446 5.6119 1.8404 16.4716 10.6087 4.9870 60.5482 27.0950 49.3110 6.4152 17.1703 1.3429 0.2395 2.2804 3.9911 18.1758 2.2002 0.4814 1.0626 0.1919 20.8466 1.5026 7.0614 6.3379 27.8959 2.4133 4.1034 0.7527 0.0782 3.9476 4.1708 5.9706 7.6831 3.8568 4.7678 4.2778 15.6653 1.7366 36.5753 5.8763 0.3931 3.6867 25.3623 97.9715 7.8590 7.7538 21.5680 7.5916 0.2160 3.8238 16.6253 12.5172 0.0673 10.9431 22.5464 2.0811 28.4053 315.9082 6.9110 1.3979 1.3433 3.8734 125.4133 126.8622 92.2894 34.9498 20.3524 12.7198 89.4798 11.0470 16.9827 4.5912 55.0814 19.2609 6.7621 6.3480 12.2537 36.4958 25.9978 39.1486 8.9500 8.2298
temp: 298.150 k
press: 1.00000 atm
elementType: 7 6 6 6 6 6 6 6 6 6 6 6 6 6 6 6 6 6 6 1 1 1 1 1 1 1 1 1 1 1 1 1 1 1 1 1 1 1
symmnumber: 1
zpe: 831524.3 jmol-1
zpe.correction: 0.316711 hartree
zpe.thermalcorrener: 0.333962 hartree
zpe.thermalcorrenthalpy: 0.334907 hartree
zpe.thermalcorrgfe: 0.268922 hartree
zpe.sumelectzpe: -750.699091 hartree
zpe.sumelectthermal: -750.681840 hartree
zpe.sumelectthermalent: -750.680895 hartree
zpe.sumelectthermalfe: -750.746880 hartree
dipole: 2.1980 0.3997 1.0574
dipole: 2.4716
quadrupole: -91.2165 -104.5785 -111.4415
quadrupole: 2.2096 -1.9638 -0.1415
quadrupole: 11.1957 -2.1663 -9.0293 2.2096 -1.9638 -0.1415
hfenergy: -751.0158019 hartree
pointgroup: C01 [X(C18H19N1)]
dipole: -0.8604306 -0.1181023 0.4373851 debye
polarizability: 264.1224617|-14.9380685|198.1770186|5.7179518|4.8225025|146.911067 unknown
InChI: InChI=1S/C18H19N/c1-19(2)17-11-7-14(8-12-17)13-16-10-9-15-5-3-4-6-18(15)16/h3-8,10-12H,9,13H2,1-2H3
charge 0 multiplicity 1
38 atoms
N  -4.696114 -0.66313 0.497494
C  1.635372 1.20972 -0.230281
C  2.537352 0.035345 -0.310397
C  3.512031 0.131165 0.73085
C  3.24809 1.399818 1.527547
C  0.468957 1.462967 -1.16681
C  2.042513 1.998389 0.818836
C  -0.877168 0.897261 -0.69778
C  2.55651 -1.05635 -1.209333
C  4.50339 -0.852351 0.878959
C  -0.995576 -0.377684 -0.088506
C  -2.070278 1.636899 -0.886818
C  -3.44903 -0.151468 0.109104
C  3.558904 -2.044607 -1.058453
C  4.523908 -1.946497 -0.025338
C  -2.243285 -0.895998 0.308514
C  -3.329508 1.137426 -0.498549
C  -4.780124 -1.978025 1.140003
C  -5.910325 0.130243 0.287099
H  3.032172 1.183479 2.594067
H  4.11865 2.086986 1.519533
H  0.715988 1.040707 -2.163598
H  0.35431 2.552404 -1.319349
H  1.570879 2.935605 1.127003
H  1.812008 -1.140116 -2.009892
H  5.253318 -0.782093 1.675926
H  -0.096264 -0.977237 0.093446
H  -2.017641 2.632907 -1.34627
H  3.590703 -2.89712 -1.746762
H  5.291381 -2.722516 0.07448
H  -2.276046 -1.883949 0.777401
H  -4.216268 1.756022 -0.664849
H  -5.83235 -2.206309 1.373833
H  -4.205413 -2.014181 2.089155
H  -4.396235 -2.785386 0.48221
H  -5.884882 1.089135 0.846766
H  -6.786657 -0.440033 0.634609
H  -6.065773 0.36997 -0.785346
