program: Gaussian 09
title: 000272069
version: EM64L-G09RevD.01
frameworkgroup: C1[X(C18H27N)]
method: RPBEPBE
basis: SDD
operation: Freq
keyword: #pfreq=noraman
keyword: PBEPBE/SDD
title: #p freq=noraman PBEPBE/SDD
converged: YES YES NO NO
title: Mulliken charges:
elementType: N C C C C C C C C C C C C C C C C C C H H H H H H H H H H H H H H H H H H H H H H H H H H H
charge: -0.154897 -0.071346 -0.123219 -0.066530 -0.489839 -0.506138 -0.468675 -0.453586 -0.404679 -0.380512 -0.672751 0.564580 -0.425320 -0.470361 -0.366443 -0.367911 0.396860 -0.647435 -0.647329 0.194538 0.219834 0.234834 0.210559 0.207582 0.220597 0.224904 0.195991 0.195277 0.208774 0.198643 0.197951 0.195041 0.194980 0.186561 0.209266 0.205701 0.222285 0.222211 0.230768 0.231071 0.230556 0.230002 0.213441 0.230037 0.230882 0.213243
chargesum: 0.00000
title: Mulliken charges with hydrogens summed into heavy atoms:
elementType: N C C C C C C C C C C C C C C C C C C
charge: -0.154897 0.123192 0.096615 0.168304 -0.071697 -0.060637 -0.077407 -0.046169 -0.011687 0.001030 -0.257784 0.564580 -0.203035 -0.248150 -0.135675 -0.136839 0.396860 0.026564 0.026834
polarizability: 2.68013188e+02 1.39360245e+00 1.85006821e+02 1.79560746e+01 -4.83351563e+00 1.47297528e+02
1716.lowfreq: -1.7883 -0.0006 0.0005 0.0007 6.8930 21.6555 27.9651 34.4726 38.5983
frequency: 27.7554 34.4025 38.0967 62.3148 77.8413 83.6668 112.7840 144.9678 145.9265 189.0386 205.7868 215.0236 225.6865 287.0323 311.9301 324.4064 349.3101 356.1814 376.9806 406.8970 416.6255 432.7555 468.6276 475.0227 512.5140 541.5219 566.4946 617.0538 637.1953 662.4211 697.5420 729.3785 769.2425 777.6384 800.1502 805.0404 806.2852 823.4030 847.1025 854.9050 887.8000 907.2473 919.5278 923.1018 936.6263 945.4339 948.6345 966.5731 998.7208 1000.4586 1025.9852 1047.2622 1052.5695 1057.3687 1061.9729 1081.4566 1096.1867 1109.7096 1112.8105 1113.6188 1121.1766 1138.8619 1149.8388 1164.4904 1165.7602 1198.9585 1203.6659 1209.1353 1226.4362 1238.5443 1245.8867 1257.1832 1266.4611 1267.2885 1288.6315 1294.6802 1303.3204 1310.8431 1314.9433 1323.9158 1330.5116 1335.4854 1338.2484 1343.7767 1355.0416 1356.4284 1358.8018 1380.9905 1423.4654 1436.9001 1459.6779 1459.7679 1461.9266 1462.7969 1465.6755 1469.3234 1471.5769 1473.0333 1477.9718 1485.7726 1495.4050 1508.0679 1527.0262 1567.0819 1635.4270 2928.1530 2934.6343 2937.4367 2953.9190 2959.9166 2960.6114 2964.8511 2967.2336 2971.0688 2977.6980 2986.9624 2990.0148 2992.6810 3005.7509 3010.0305 3014.9705 3021.3444 3023.9396 3034.9473 3035.9325 3062.6173 3089.7569 3099.6388 3106.1251 3111.0196 3157.3541 3161.5429
redmass: 3.3777 3.7368 3.3738 2.9180 2.3735 2.6041 2.1068 3.0526 2.1952 2.5294 1.1776 2.2919 2.2426 2.2302 2.2063 2.9444 2.4719 2.1616 2.8797 3.0768 2.9422 3.0659 2.2102 3.0747 2.7370 2.8960 2.9101 2.3635 6.6192 2.6146 3.7832 3.2183 2.1467 2.3054 1.7778 2.3851 1.2768 2.3035 2.3130 2.0360 2.0297 1.7563 1.6734 1.9217 1.5893 3.0663 1.3517 2.3824 2.8681 1.9504 1.7922 2.0476 1.6659 1.4918 1.4820 1.8973 1.4367 1.3154 1.2389 1.1918 1.7678 1.9604 1.5801 1.6721 1.4805 1.1597 1.4313 1.4202 1.9811 1.3390 1.4803 1.2794 2.7582 1.3443 1.3393 1.3622 1.3492 1.3850 1.3246 1.5814 1.5332 1.3850 1.4345 1.5059 1.4434 3.4186 1.4906 4.9141 2.0408 1.4370 1.2087 1.0890 1.0891 1.0424 1.0933 1.0826 1.0853 1.0464 1.0913 1.0924 1.0830 1.1049 2.6084 6.5498 6.3198 1.0371 1.0792 1.0399 1.0602 1.0613 1.0644 1.0620 1.0676 1.0729 1.0824 1.0685 1.0988 1.1028 1.0657 1.0989 1.0992 1.0966 1.1000 1.1028 1.1024 1.1036 1.0953 1.0933 1.0891 1.0889 1.0922 1.0931
irintensity: 0.0562 0.8731 0.1308 1.2466 1.8426 2.9200 0.0532 0.1489 0.0923 0.0755 0.1537 0.4967 0.5873 0.1042 0.4019 2.8038 0.7588 0.7935 0.3616 0.2561 0.0203 0.3974 1.5638 3.0492 9.3795 8.8383 4.2011 8.2369 0.1368 4.8046 0.1655 0.0833 1.2092 16.5447 17.0652 13.9222 0.9305 26.7088 5.6135 3.6247 0.8115 6.8431 5.1403 1.8244 3.2405 17.6529 0.1563 5.6711 0.2560 1.0057 1.5001 1.0302 1.0230 23.7739 3.4343 1.3331 0.7455 1.3607 0.0035 0.5945 4.0462 1.7754 1.2637 5.6867 10.6405 14.8013 3.5813 2.0562 1.4931 8.0894 3.2477 0.9041 32.5975 2.0160 1.1979 0.4007 3.8367 8.0511 0.2609 2.6320 1.0349 0.2440 2.3648 0.8758 3.7286 120.9933 0.7308 5.9983 6.2362 0.3200 14.0248 0.8136 3.5099 0.3615 10.9633 19.7807 2.0470 19.5444 12.0791 7.6341 2.1670 26.3398 303.8882 4.8283 132.2953 126.3083 21.5131 97.7488 30.3013 42.1207 50.8913 12.0705 9.4775 63.6304 17.9176 77.8374 2.6464 101.2591 39.9690 50.1653 42.5619 58.7774 48.3472 92.5261 71.3895 62.8501 4.9188 56.6915 18.2903 26.3065 29.8897 9.7869
temp: 298.150 k
press: 1.00000 atm
elementType: 7 6 6 6 6 6 6 6 6 6 6 6 6 6 6 6 6 6 6 1 1 1 1 1 1 1 1 1 1 1 1 1 1 1 1 1 1 1 1 1 1 1 1 1 1 1
symmnumber: 1
zpe: 1074488.0 jmol-1
zpe.correction: 0.409251 hartree
zpe.thermalcorrener: 0.427930 hartree
zpe.thermalcorrenthalpy: 0.428875 hartree
zpe.thermalcorrgfe: 0.361250 hartree
zpe.sumelectzpe: -755.400349 hartree
zpe.sumelectthermal: -755.381670 hartree
zpe.sumelectthermalent: -755.380726 hartree
zpe.sumelectthermalfe: -755.448351 hartree
dipole: -1.9816 0.3333 -0.7510
dipole: 2.1451
quadrupole: -95.6971 -112.1267 -120.2481
quadrupole: -1.1520 6.3930 -2.4811
quadrupole: 13.6602 -2.7694 -10.8908 -1.1520 6.3930 -2.4811
hfenergy: -755.8096004 hartree
pointgroup: C01 [X(C18H27N1)]
dipole: 0.781674 0.1213259 0.2941579 debye
polarizability: 267.7784545|-2.8629872|185.3692907|18.5512861|3.1535492|147.1697924 unknown
InChI: InChI=1S/C18H27N/c1-19(2)17-11-7-14(8-12-17)13-16-10-9-15-5-3-4-6-18(15)16/h7-8,11-12,15-16,18H,3-6,9-10,13H2,1-2H3
charge 0 multiplicity 1
46 atoms
N  4.974832 0.225121 0.501058
C  -3.020311 -0.251527 -0.773533
C  -3.870864 -0.85377 0.384071
C  -1.554089 -0.255739 -0.228022
C  -2.956665 -1.989764 0.913375
C  -1.50888 -1.409444 0.833563
C  -3.537077 1.115227 -1.287913
C  -4.197387 0.193766 1.480679
C  -3.858988 2.113709 -0.148789
C  -4.815542 1.481431 0.889223
C  -0.502348 -0.405224 -1.364886
C  0.938514 -0.245518 -0.900178
C  1.449099 1.02169 -0.516429
C  1.823983 -1.347436 -0.807353
C  2.769293 1.188779 -0.057589
C  3.150309 -1.207167 -0.350087
C  3.657946 0.070804 0.04185
C  5.468208 1.552184 0.880585
C  5.863031 -0.938098 0.579987
H  -3.054057 -0.973474 -1.619575
H  -4.829196 -1.251409 -0.009156
H  -1.355922 0.709208 0.280141
H  -3.048959 -2.877783 0.257949
H  -3.229092 -2.308748 1.937099
H  -1.185692 -1.020566 1.815893
H  -0.774427 -2.185578 0.550551
H  -4.462763 0.948733 -1.877515
H  -2.799248 1.55836 -1.987439
H  -3.269855 0.461946 2.027257
H  -4.881954 -0.258907 2.22533
H  -4.303439 3.034107 -0.575571
H  -2.92436 2.420816 0.364023
H  -5.040075 2.205616 1.69671
H  -5.780814 1.238138 0.397061
H  -0.728235 0.348177 -2.148428
H  -0.636724 -1.400123 -1.835729
H  0.799616 1.904804 -0.584203
H  1.471807 -2.343715 -1.105443
H  3.11013 2.190716 0.219414
H  3.78901 -2.094087 -0.302681
H  4.873827 1.993599 1.707549
H  5.443488 2.265154 0.029693
H  6.512454 1.47178 1.222702
H  6.022879 -1.408081 -0.413229
H  5.463659 -1.718052 1.261391
H  6.845782 -0.624357 0.966892
