program: Gaussian 09
title: 000272071
version: EM64L-G09RevD.01
frameworkgroup: C1[X(C18H21N)]
method: RPBEPBE
basis: SDD
operation: Freq
keyword: #pfreq=noraman
keyword: PBEPBE/SDD
title: #p freq=noraman PBEPBE/SDD
converged: YES YES NO NO
title: Mulliken charges:
elementType: N C C C C C C C C C C C C C C C C C C H H H H H H H H H H H H H H H H H H H H H
charge: -0.154645 -0.248074 -0.489472 0.332573 -0.578126 0.272432 -0.619293 0.542193 -0.442520 -0.416263 -0.237179 -0.234045 -0.454419 -0.414721 -0.366216 -0.366892 0.399368 -0.647133 -0.647247 0.242279 0.234387 0.223594 0.224069 0.226887 0.223263 0.213413 0.238988 0.236066 0.221456 0.221147 0.225731 0.221609 0.232318 0.232015 0.231335 0.230662 0.214157 0.231111 0.230947 0.214247
chargesum: 0.00000
title: Mulliken charges with hydrogens summed into heavy atoms:
elementType: N C C C C C C C C C C C C C C C C C C
charge: -0.154645 -0.005795 -0.031491 0.332573 -0.127170 0.272432 -0.182617 0.542193 -0.203532 -0.180197 -0.015723 -0.012899 -0.228688 -0.193113 -0.133898 -0.134877 0.399368 0.029021 0.029059
polarizability: 3.07962939e+02 7.56200800e+00 1.87927933e+02 1.98771607e+01 -6.40659731e+00 1.17489831e+02
1716.lowfreq: -4.5018 -0.0007 0.0003 0.0005 3.7477 9.7196 24.6685 29.7958 37.2848
frequency: 24.4553 29.7575 37.2171 76.0414 81.6305 93.2195 101.2834 136.0128 188.4976 204.8200 209.0055 228.6850 249.1791 317.9931 339.9822 367.8669 372.6780 417.1706 422.8456 436.6145 472.9927 503.5436 519.4056 540.2553 550.0227 592.9614 636.5475 650.3515 693.3890 722.8924 727.2999 756.0635 765.0386 793.2007 806.1203 809.4931 825.3848 855.0199 872.7298 895.7262 923.7866 931.6869 942.7346 945.6413 948.9105 967.7107 982.1994 998.9493 1021.4900 1038.8086 1055.1869 1057.2058 1081.5923 1109.6820 1112.0050 1116.5986 1141.1975 1157.8870 1164.3830 1168.1083 1180.9263 1194.0777 1198.3898 1213.3821 1227.4812 1251.1447 1262.4304 1266.2084 1292.4033 1298.6376 1308.8791 1317.9922 1331.5449 1356.8475 1380.2167 1388.4420 1423.4123 1436.3576 1444.9522 1458.0409 1458.8633 1462.3193 1465.8073 1473.0775 1474.6611 1476.2574 1495.2975 1508.0893 1527.5923 1565.9829 1594.7479 1614.9073 1634.8587 2929.1577 2938.2644 2971.7995 2974.0777 2991.6294 2992.9650 2994.2454 3009.4052 3032.6236 3041.9635 3072.7352 3090.0584 3100.2069 3105.8806 3110.7395 3112.8355 3119.3375 3134.5834 3155.5402 3157.5783 3162.7647
redmass: 3.7696 3.5715 4.2419 2.5307 3.2756 3.4617 2.7211 2.1747 2.4107 1.8880 1.3847 1.9956 3.3187 3.1118 2.3477 2.9489 3.8614 2.9366 3.0392 2.8549 3.3944 3.1168 3.5980 2.8334 3.6833 4.8490 6.2317 3.0245 3.6804 2.9045 3.5189 1.3865 2.5982 2.4884 1.2637 3.0019 2.8341 2.7450 1.3609 2.1727 1.8615 1.4256 1.5262 2.7624 1.3546 2.5325 1.3157 2.9596 2.2455 2.0273 1.8569 1.6174 2.2556 1.3138 1.2408 1.3111 1.2263 1.6349 1.7423 1.0695 1.4836 1.3584 1.1661 1.6626 2.0370 1.5380 1.6123 2.8643 1.4361 1.6619 1.3553 1.4466 1.3757 3.4115 5.0826 6.5240 1.9492 1.4918 2.3924 1.2225 1.2134 1.0408 1.1421 1.0467 1.2159 1.7229 1.0825 1.1058 2.6106 6.5304 6.8346 7.0463 6.2817 1.0370 1.0398 1.0635 1.0619 1.0988 1.0778 1.1029 1.0726 1.1004 1.0939 1.1026 1.0955 1.0934 1.0892 1.0891 1.0855 1.0891 1.0940 1.1002 1.0925 1.0930
irintensity: 0.0334 0.0664 1.2331 0.7246 2.8555 0.6934 1.7258 0.1409 0.0556 0.2185 0.2497 1.6747 3.9008 0.7396 1.3355 0.6429 3.1652 0.0632 2.5930 8.2181 3.1613 3.9634 7.8533 15.5047 3.1429 2.1125 0.0483 0.3564 0.4930 4.9949 0.1224 53.5293 19.4428 48.5949 0.2888 17.2231 15.3953 11.0521 0.4942 2.3296 0.8232 0.6136 2.9599 19.2261 0.1349 1.7876 0.0226 0.2350 8.6397 6.0749 9.2547 17.2304 8.5628 1.1369 0.0501 1.2035 8.1157 5.9956 11.3560 0.2503 3.6817 1.1733 18.8028 0.9634 1.5256 3.8204 3.0698 33.6631 0.3265 4.5594 1.4305 3.2170 5.2026 132.8570 4.8522 3.6046 6.3086 0.1405 5.0384 9.9846 13.0064 0.0881 8.7905 20.1486 7.7590 22.6592 1.9009 29.0127 311.2363 4.2318 0.7898 3.6910 150.7998 124.3338 100.1344 32.4677 36.0314 1.3686 7.0709 100.8101 38.4505 28.8374 32.3896 36.9185 4.8689 57.5403 17.1373 24.5485 7.9212 3.4653 37.4779 42.9954 26.7480 12.5775
temp: 298.150 k
press: 1.00000 atm
elementType: 7 6 6 6 6 6 6 6 6 6 6 6 6 6 6 6 6 6 6 1 1 1 1 1 1 1 1 1 1 1 1 1 1 1 1 1 1 1 1 1
symmnumber: 1
zpe: 893441.6 jmol-1
zpe.correction: 0.340294 hartree
zpe.thermalcorrener: 0.357872 hartree
zpe.thermalcorrenthalpy: 0.358817 hartree
zpe.thermalcorrgfe: 0.293156 hartree
zpe.sumelectzpe: -751.885277 hartree
zpe.sumelectthermal: -751.867698 hartree
zpe.sumelectthermalent: -751.866754 hartree
zpe.sumelectthermalfe: -751.932415 hartree
dipole: 3.0897 0.3909 0.4925
dipole: 3.1531
quadrupole: -90.2845 -104.4975 -118.9131
quadrupole: -0.2851 4.0206 -2.7133
quadrupole: 14.2806 0.0675 -14.3481 -0.2851 4.0206 -2.7133
hfenergy: -752.2255707 hartree
pointgroup: C01 [X(C18H21N1)]
dipole: -1.2136956 0.2040108 -0.1555697 debye
polarizability: 307.876552|-12.6511614|184.4564643|17.0269394|17.0874514|121.0476865 unknown
InChI: InChI=1S/C18H21N/c1-19(2)17-11-7-14(8-12-17)13-16-10-9-15-5-3-4-6-18(15)16/h3-8,11-12,16H,9-10,13H2,1-2H3
charge 0 multiplicity 1
40 atoms
N  -5.187442 0.133289 -0.083367
C  1.379203 -0.121098 -0.569454
C  1.348443 1.396476 -0.945298
C  2.867112 -0.371054 -0.334277
C  2.593929 2.027548 -0.245874
C  3.558418 0.852752 -0.132223
C  0.544084 -0.457594 0.715954
C  -0.956413 -0.304475 0.526184
C  3.553662 -1.600166 -0.257173
C  4.941372 0.855635 0.141125
C  4.945074 -1.599514 0.011685
C  5.634701 -0.378852 0.209733
C  -1.671807 0.796455 1.05963
C  -1.702121 -1.256261 -0.216789
C  -3.059321 0.952864 0.866317
C  -3.087929 -1.123387 -0.423921
C  -3.806047 -0.007601 0.114232
C  -5.893565 1.286561 0.482683
C  -5.926902 -0.880339 -0.841848
H  0.982864 -0.744518 -1.394058
H  0.398262 1.87774 -0.656107
H  1.457207 1.501987 -2.040956
H  2.33543 2.413465 0.761418
H  3.013125 2.87754 -0.814362
H  0.895398 0.190915 1.542173
H  0.787319 -1.498294 1.009832
H  3.0245 -2.54828 -0.413748
H  5.479834 1.798896 0.293443
H  5.493045 -2.547572 0.062381
H  6.711888 -0.39023 0.413057
H  -1.132913 1.548532 1.650835
H  -1.187776 -2.13042 -0.6384
H  -3.560095 1.819464 1.307382
H  -3.612986 -1.890914 -0.999863
H  -5.497227 2.24665 0.091371
H  -5.819621 1.317151 1.590035
H  -6.961337 1.23003 0.217257
H  -5.862759 -1.882331 -0.368189
H  -5.552772 -0.974318 -1.882611
H  -6.990841 -0.598435 -0.890909
