program: Gaussian 09
title: 000272052
version: EM64L-G09RevD.01
frameworkgroup: C1[X(C14H12O2)]
method: RPBEPBE
basis: SDD
operation: Freq
keyword: #pfreq=noraman
keyword: PBEPBE/SDD
title: #p freq=noraman PBEPBE/SDD
converged: YES YES NO NO
title: Mulliken charges:
elementType: O O C C C C C C C C C C C C C C H H H H H H H H H H H H
charge: -0.433234 -0.450812 -0.337455 0.060413 0.224530 0.186971 0.125404 0.322619 -0.414125 -0.404390 -0.355530 -0.427625 -0.229528 -0.491858 -0.229769 -0.260305 0.250008 0.262532 0.259474 0.304926 0.231670 0.230730 0.225572 0.211232 0.228280 0.228743 0.338627 0.342899
chargesum: 0.00000
title: Mulliken charges with hydrogens summed into heavy atoms:
elementType: O O C C C C C C C C C C C C C C
charge: -0.094607 -0.107913 -0.087447 0.060413 0.224530 0.186971 0.125404 0.322619 -0.151593 -0.144917 -0.050604 -0.195956 0.001202 -0.055054 -0.001488 -0.031561
polarizability: 2.20990426e+02 1.48081307e+01 1.75973289e+02 5.31066535e-01 7.46602931e-02 7.82786071e+01
1716.lowfreq: -7.7797 0.0003 0.0004 0.0007 6.2383 6.7922 61.6819 98.3517 111.5844
frequency: 61.6682 98.3502 111.5776 127.6943 151.8308 188.9373 200.1832 260.0999 294.2552 324.1347 351.2745 362.5518 392.3810 420.6298 436.0150 493.4048 515.9602 536.3745 565.9245 598.9169 615.3285 666.5374 678.5895 740.7080 749.2296 769.2480 783.2620 827.2085 828.0656 889.3360 896.6509 928.1640 943.9227 954.6668 962.8779 978.8503 991.7277 995.0096 1022.4409 1032.8986 1080.4695 1102.0354 1153.3979 1174.0428 1177.8101 1181.6765 1201.2769 1204.1792 1230.2527 1243.6351 1262.2329 1298.0064 1307.8893 1354.0638 1373.6170 1375.6942 1396.8404 1432.9390 1453.8078 1462.7572 1473.6170 1481.7044 1588.6414 1595.1484 1610.1427 1617.8401 2975.0615 3020.6102 3057.7894 3117.6649 3127.3839 3138.8614 3141.1421 3157.6837 3160.1091 3171.5713 3546.6349 3567.9870
redmass: 5.6086 3.6002 4.3015 4.8722 4.8521 3.5062 3.9794 3.8456 1.8899 2.1880 2.4795 1.3081 4.1422 4.7275 3.2853 4.1689 4.8712 5.3084 3.3322 5.4279 5.1912 5.3187 4.9944 3.2248 2.1909 2.2751 1.5504 3.9675 3.0866 1.4809 2.0699 1.7102 6.4859 1.6318 1.8193 1.3562 1.4303 5.2496 3.5025 2.3160 1.8388 1.8914 1.1670 1.1030 1.1599 1.3769 1.3446 1.9868 2.0907 4.7781 1.8709 1.3332 1.4697 1.1765 1.2359 7.2548 3.0579 2.6742 2.7301 3.1922 1.4107 1.9646 6.6359 7.7402 7.0639 7.1662 1.0658 1.0833 1.0976 1.0877 1.0856 1.0902 1.0911 1.0968 1.0988 1.0976 1.0662 1.0664
irintensity: 1.6039 1.9384 2.1835 0.4615 0.4248 1.7110 0.3850 4.6521 59.1542 58.7321 49.1082 111.0592 8.0525 22.7928 4.9207 3.9149 3.0764 2.3239 1.0722 9.1943 11.8746 2.5782 12.2129 34.1679 39.2735 92.4536 0.7497 9.7660 12.7490 10.2237 23.3494 14.3493 66.3822 6.8284 5.0493 0.6030 0.0618 3.5144 42.7165 5.0961 6.5565 1.6226 14.9432 3.1671 6.1893 6.8716 31.6246 4.0995 1.7443 4.9332 11.4491 9.6241 1.0966 40.9080 24.4589 7.9644 3.4667 31.9044 13.0681 3.0176 9.1258 2.4614 1.5550 1.4733 3.2330 3.5875 73.3364 9.5365 16.3133 10.8262 1.4361 8.4488 15.0945 27.7535 24.2827 14.3396 8.0916 5.9727
temp: 298.150 k
press: 1.00000 atm
elementType: 8 8 6 6 6 6 6 6 6 6 6 6 6 6 6 6 1 1 1 1 1 1 1 1 1 1 1 1
symmnumber: 1
zpe: 578771.9 jmol-1
zpe.correction: 0.220443 hartree
zpe.thermalcorrener: 0.233536 hartree
zpe.thermalcorrenthalpy: 0.234480 hartree
zpe.thermalcorrgfe: 0.181278 hartree
zpe.sumelectzpe: -690.013800 hartree
zpe.sumelectthermal: -690.000707 hartree
zpe.sumelectthermalent: -689.999763 hartree
zpe.sumelectthermalfe: -690.052965 hartree
dipole: -1.4956 0.2946 0.4167
dipole: 1.5803
quadrupole: -78.9559 -100.0251 -91.3725
quadrupole: 3.0554 -1.1236 -0.0468
quadrupole: 11.1620 -9.9073 -1.2547 3.0554 -1.1236 -0.0468
hfenergy: -690.2342426 hartree
pointgroup: C01 [X(C14H12O2)]
dipole: 0.5869821 0.1382408 -0.1512543 debye
polarizability: 222.1474006|-12.3047599|174.4261795|5.6544247|-4.5029984|78.6687423 unknown
InChI: InChI=1S/C14H12O2/c15-8-9-4-3-7-12-13(9)10-5-1-2-6-11(10)14(12)16/h1-7,14-16H,8H2
charge 0 multiplicity 1
28 atoms
O  -0.904851 -3.052904 -0.709564
O  1.33538 2.977823 -0.930821
C  -0.645543 -2.002971 0.296666
C  0.677776 0.033036 0.19495
C  0.755258 -1.392235 0.24366
C  -1.544435 -0.774093 0.182147
C  -0.75795 0.41694 0.124608
C  1.869417 0.808875 0.2305
C  1.985931 -2.065258 0.278025
C  -2.945571 -0.728548 0.120639
C  -1.391258 1.673658 -0.014371
C  3.109057 0.114393 0.265162
C  3.177181 -1.298022 0.273638
C  1.872906 2.325493 0.285186
C  -3.579635 0.534432 -0.000518
C  -2.80559 1.718595 -0.069044
H  -0.807177 -2.541929 1.248814
H  2.018891 -3.159668 0.304795
H  -3.533076 -1.652464 0.15493
H  -0.80219 2.587127 -0.131183
H  4.03882 0.696765 0.293437
H  4.152645 -1.795867 0.293875
H  1.21353 2.695886 1.089369
H  2.900517 2.690839 0.485554
H  -4.672525 0.59485 -0.052444
H  -3.308226 2.685923 -0.181305
H  -0.814415 -2.646256 -1.609866
H  1.764834 2.57288 -1.726039
