program: Gaussian 09
title: 000272059
version: EM64L-G09RevD.01
frameworkgroup: C1[X(C15H10O3)]
method: RPBEPBE
basis: SDD
operation: Freq
keyword: #pfreq=noraman
keyword: PBEPBE/SDD
title: #p freq=noraman PBEPBE/SDD
converged: YES YES NO NO
title: Mulliken charges:
elementType: O O O C C C C C C C C C C C C C C C H H H H H H H H H H
charge: -0.154703 -0.426380 -0.205511 0.117128 0.251417 0.233852 0.204936 0.418683 -0.328158 -0.434954 -0.672569 -0.376586 -0.374391 -0.428565 -0.234022 -0.252617 -0.229222 0.207072 0.282783 0.261863 0.258108 0.234713 0.277740 0.281873 0.237702 0.231555 0.237009 0.381241
chargesum: 0.00000
title: Mulliken charges with hydrogens summed into heavy atoms:
elementType: O O O C C C C C C C C C C C C C C C
charge: -0.154703 -0.045139 -0.205511 0.117128 0.251417 0.233852 0.204936 0.418683 -0.328158 -0.152171 -0.152597 -0.141872 -0.096651 -0.146692 0.003680 -0.021062 0.007787 0.207072
polarizability: 2.08971529e+02 -2.34798705e+01 2.26785983e+02 1.28807827e+01 7.79942166e+00 8.23405420e+01
1716.lowfreq: -6.1106 -4.7246 -0.0005 -0.0003 0.0002 3.2778 15.0838 52.3195 66.1029
frequency: 15.0588 52.3053 66.0963 100.0831 124.6216 152.0921 188.8257 222.4777 266.4908 295.5154 317.2849 346.9872 412.7328 417.0089 443.4663 480.8531 513.2821 523.7655 550.2652 561.4794 563.8401 628.8803 647.6166 672.2549 681.9063 720.6779 753.9118 766.3409 785.4281 796.0726 841.7323 860.9891 877.7034 906.8946 917.1929 944.1779 972.0278 976.1501 992.4887 995.6341 1000.0026 1032.1948 1041.0988 1081.7888 1087.0085 1164.6578 1175.4232 1179.2818 1184.7258 1213.5694 1232.7618 1253.5050 1281.1880 1301.0779 1328.4242 1370.4130 1399.1285 1437.3543 1451.1000 1461.5533 1465.7703 1479.9217 1587.8032 1598.3103 1608.6744 1615.5714 1635.1755 1674.5582 3012.8983 3093.4462 3131.1275 3133.2093 3147.1098 3149.0429 3163.0007 3167.3805 3174.1865 3506.9097
redmass: 10.6972 6.8314 6.5623 5.0370 4.9843 7.2196 4.5534 4.5460 7.3396 5.1063 4.7698 3.7332 6.1730 3.5302 4.0620 2.7757 4.3363 3.7820 5.4590 5.5348 3.1762 3.9194 2.2343 3.0767 4.5990 4.7919 1.4101 5.9291 1.3715 4.4825 3.3074 5.2242 4.0627 1.5322 2.3046 1.5031 1.6853 2.9513 1.4002 6.0738 1.3633 2.2844 2.1927 1.8304 2.1917 1.5547 1.2817 1.2405 1.6355 2.2007 2.6492 2.0798 1.6539 1.5207 1.8790 7.8900 2.5394 2.5638 2.7084 1.2749 2.9298 2.7779 6.9625 7.4030 7.8837 7.2257 10.5938 8.6476 1.0643 1.0964 1.0879 1.0861 1.0911 1.0912 1.0965 1.0993 1.0974 1.0639
irintensity: 1.6567 0.7343 0.3912 4.6121 0.3275 0.4227 0.5988 0.6297 4.0276 0.9190 0.8479 2.3403 2.2034 0.2823 4.6529 7.8214 6.3388 8.1881 25.1002 9.7695 0.9418 29.0884 84.6084 47.0232 8.6993 5.2486 132.2210 2.2259 2.6094 3.3137 6.6214 25.4546 10.8904 1.1775 7.6111 1.3535 10.6858 15.4907 1.8188 3.5613 0.2935 41.2862 163.0330 32.8453 15.4932 3.3796 3.4950 0.2828 21.3681 5.4710 43.5809 21.2396 3.2514 17.1860 51.0933 2.4008 8.7123 28.8047 4.2282 24.1357 24.7026 3.8579 73.7099 10.3746 57.8040 64.2398 101.3231 204.6518 11.0368 3.2500 6.4581 3.4667 7.5236 5.7383 21.6077 19.9009 11.5231 25.3609
temp: 298.150 k
press: 1.00000 atm
elementType: 8 8 8 6 6 6 6 6 6 6 6 6 6 6 6 6 6 6 1 1 1 1 1 1 1 1 1 1
symmnumber: 1
zpe: 546531.7 jmol-1
zpe.correction: 0.208163 hartree
zpe.thermalcorrener: 0.222266 hartree
zpe.thermalcorrenthalpy: 0.223210 hartree
zpe.thermalcorrgfe: 0.165526 hartree
zpe.sumelectzpe: -802.062907 hartree
zpe.sumelectthermal: -802.048804 hartree
zpe.sumelectthermalent: -802.047860 hartree
zpe.sumelectthermalfe: -802.105544 hartree
dipole: -2.5884 -3.0076 -1.7830
dipole: 4.3502
quadrupole: -104.5710 -88.2066 -107.6363
quadrupole: -8.6508 4.6084 -4.1463
quadrupole: -4.4330 11.9314 -7.4983 -8.6508 4.6084 -4.1463
hfenergy: -802.2710699 hartree
pointgroup: C01 [X(C15H10O3)]
dipole: 0.9653786 -1.2294963 0.6968728 debye
polarizability: 211.0171587|24.1143264|224.7888131|12.7603631|-7.6861185|82.2920822 unknown
InChI: InChI=1S/C15H10O3/c16-13(17)8-9-4-3-7-12-14(9)10-5-1-2-6-11(10)15(12)18/h1-7,16H,8H2
charge 0 multiplicity 1
28 atoms
O  -2.970909 2.114343 -0.496091
O  2.805588 -2.675602 -0.185258
O  3.52246 -0.792418 -1.342717
C  0.193682 0.537777 0.250804
C  -0.736479 -0.635562 0.205903
C  -0.567609 1.715188 -0.032191
C  -2.053598 -0.151194 -0.07124
C  1.576849 0.653426 0.52337
C  -2.007963 1.339645 -0.238102
C  0.006831 2.992014 -0.081466
C  2.455812 -0.536637 0.885669
C  2.15678 1.953464 0.464424
C  -0.534171 -2.022033 0.360796
C  -3.160742 -1.005274 -0.171817
C  1.397807 3.105501 0.16381
C  -1.655175 -2.891404 0.263397
C  -2.955159 -2.397281 0.005842
C  2.980259 -1.287599 -0.335752
H  -0.614088 3.865975 -0.303089
H  1.93749 -1.245259 1.549631
H  3.3492 -0.17565 1.429735
H  3.231021 2.055695 0.658343
H  0.456605 -2.452416 0.528868
H  -4.152863 -0.593994 -0.385588
H  1.887747 4.083904 0.128499
H  -1.503733 -3.969868 0.385646
H  -3.7986 -3.092268 -0.06411
H  3.175358 -3.143674 -0.983314
