program: Gaussian 09
title: 000272062
version: EM64L-G09RevD.01
frameworkgroup: C1[X(C17H14O3)]
method: RPBEPBE
basis: SDD
operation: Freq
keyword: #pfreq=noraman
keyword: PBEPBE/SDD
title: #p freq=noraman PBEPBE/SDD
converged: YES YES NO NO
title: Mulliken charges:
elementType: O O O C C C C C C C C C C C C C C C C C H H H H H H H H H H H H H H
charge: -0.291295 -0.158827 -0.273480 0.194830 0.268381 0.195324 0.191945 0.113462 -0.325511 -0.426438 -0.361636 -0.426373 -0.323062 -0.229503 0.185346 -0.242032 -0.225714 -0.259911 -0.363392 -0.678923 0.287350 0.328792 0.281194 0.279808 0.241434 0.231808 0.236496 0.219944 0.227422 0.212737 0.235372 0.209804 0.226961 0.217688
chargesum: 0.00000
title: Mulliken charges with hydrogens summed into heavy atoms:
elementType: O O O C C C C C C C C C C C C C C C C C
charge: -0.291295 -0.158827 -0.273480 0.194830 0.268381 0.195324 0.191945 0.113462 -0.325511 -0.139088 -0.032844 -0.145178 -0.043254 0.011931 0.185346 -0.010224 0.010781 0.187456 0.084716 -0.024470
polarizability: 2.73693441e+02 1.67497364e+01 2.51465474e+02 -1.00772642e+01 4.00709345e+00 8.93939940e+01
1716.lowfreq: -6.4266 -3.4147 0.0003 0.0007 0.0008 6.9668 10.6629 36.3886 51.0775
frequency: 9.7067 36.3176 51.0542 71.2790 80.1945 115.2456 144.3495 151.6471 183.7464 213.0631 216.6202 241.5302 269.6584 275.7961 296.6975 323.6274 371.1453 415.3135 444.8388 457.3384 472.7159 487.6080 535.3175 563.8755 577.2467 626.6908 664.8123 668.0366 719.4141 728.8410 759.2036 759.8526 764.9353 793.8150 802.2769 810.7317 865.4592 877.8932 890.9412 915.8962 923.4647 964.5785 967.2106 987.2772 992.4769 1005.8651 1018.7853 1027.3002 1046.9644 1059.6611 1087.3283 1100.5819 1122.7372 1159.9690 1167.5045 1173.4552 1190.0513 1205.2538 1234.5142 1249.8772 1254.9401 1291.8630 1294.1374 1308.2173 1367.3234 1373.3394 1391.3462 1392.6454 1427.3055 1450.2712 1451.4685 1457.6687 1468.2196 1475.9185 1479.1140 1487.4862 1568.9737 1588.8767 1605.5400 1613.4741 1617.6586 1634.9057 2979.3993 3002.0185 3023.6273 3050.4090 3076.2890 3084.6819 3104.6302 3133.1204 3144.8312 3147.5616 3162.4415 3164.5578 3189.3892 3199.8620
redmass: 4.2182 4.5710 4.1446 4.9018 2.0671 4.5260 3.8831 6.8571 4.5550 3.4159 1.2954 4.5590 4.1325 8.7721 4.3337 4.1144 6.5004 3.7247 4.0234 5.1720 7.4814 5.1152 7.2526 3.1682 6.7335 7.1419 6.6129 5.8265 3.9430 5.0693 1.4243 1.5092 3.1169 1.7116 4.7553 3.1474 2.8158 2.2917 1.3050 3.8058 1.4397 5.6683 1.4737 1.4229 7.0879 1.3878 1.3601 2.0674 3.0304 2.9612 1.8431 3.0547 2.2903 1.7000 1.2688 1.4981 2.1340 2.1228 2.0897 1.3429 3.1958 1.1051 1.5473 1.3212 1.9011 3.2325 2.4000 1.2059 2.8270 2.1396 1.2888 2.6685 4.0373 1.0502 1.0445 1.0823 7.4478 7.2908 7.7676 7.7999 8.9302 10.4455 1.0360 1.0604 1.0576 1.1008 1.1020 1.0990 1.1085 1.0864 1.0880 1.0918 1.0954 1.0991 1.0950 1.0943
irintensity: 0.2837 0.1160 1.1675 5.2850 0.0094 0.9800 0.6064 0.1124 0.5246 0.8443 0.6470 0.1790 1.2062 8.4670 2.0591 20.9610 0.4698 0.9024 5.8890 2.5925 3.8834 2.3970 1.7677 0.0519 2.2680 0.5808 3.1511 12.2889 2.6883 5.0648 128.6600 12.6604 4.1207 0.0363 13.3495 0.4934 18.7151 13.8534 8.0511 11.9091 0.2217 75.2686 3.9769 4.6831 1.8946 1.8254 3.1207 19.4920 13.8387 221.5926 18.4057 213.8529 1.4279 32.7488 7.2699 8.1855 51.6750 26.1419 225.9129 6.6225 33.0714 1.6829 9.0721 8.8235 0.2122 8.5641 21.2098 9.8777 57.5583 7.9428 13.5774 37.3155 11.5376 4.8388 11.4249 17.4479 130.3513 18.2102 68.2850 0.1962 117.1691 139.1061 38.2516 10.3511 52.7244 0.5087 30.3222 38.5083 36.3527 3.7886 1.9779 9.2136 16.5853 22.7549 5.7481 27.8863
temp: 298.150 k
press: 1.00000 atm
elementType: 8 8 8 6 6 6 6 6 6 6 6 6 6 6 6 6 6 6 6 6 1 1 1 1 1 1 1 1 1 1 1 1 1 1
symmnumber: 1
zpe: 692656.4 jmol-1
zpe.correction: 0.263819 hartree
zpe.thermalcorrener: 0.280961 hartree
zpe.thermalcorrenthalpy: 0.281905 hartree
zpe.thermalcorrgfe: 0.216550 hartree
zpe.sumelectzpe: -880.506234 hartree
zpe.sumelectthermal: -880.489092 hartree
zpe.sumelectthermalent: -880.488148 hartree
zpe.sumelectthermalfe: -880.553503 hartree
dipole: 4.1802 -0.6369 -0.1796
dipole: 4.2322
quadrupole: -111.2795 -102.9292 -118.5301
quadrupole: 11.3536 0.5949 -0.1426
quadrupole: -0.3666 7.9837 -7.6171 11.3536 0.5949 -0.1426
hfenergy: -880.7700533 hartree
pointgroup: C01 [X(C17H14O3)]
dipole: 1.6640147 -0.0598006 0.002545 debye
polarizability: 270.1476968|18.7854611|253.0645362|0.0926913|20.73925|91.3406761 unknown
InChI: InChI=1S/C17H14O3/c1-2-10-20-17(19)14-9-5-8-13-15(14)11-6-3-4-7-12(11)16(13)18/h3-9H,2,10H2,1H3
charge 0 multiplicity 1
34 atoms
O  2.973906 0.954405 -0.192746
O  -4.285936 0.880934 0.26741
O  1.964044 -1.132715 -0.245064
C  -0.716394 0.31779 0.017562
C  -1.272389 -1.07292 -0.148024
C  -1.833844 1.200558 0.194575
C  -2.701735 -0.995614 -0.071821
C  0.58872 0.895207 0.025656
C  -3.115533 0.421331 0.146864
C  -1.712621 2.581727 0.37899
C  -0.675695 -2.335306 -0.348309
C  -3.528466 -2.121849 -0.191456
C  0.704476 2.311705 0.213596
C  -0.413456 3.145453 0.389234
C  1.853392 0.115484 -0.144991
C  -1.510754 -3.478755 -0.471739
C  -2.919833 -3.384835 -0.396114
C  4.301607 0.284484 -0.328322
C  4.868005 -0.101169 1.045566
C  6.281932 -0.70937 0.91108
H  -2.613096 3.191138 0.508905
H  0.409167 -2.427558 -0.401655
H  -4.615767 -2.009476 -0.125802
H  1.709409 2.739394 0.215969
H  -0.273439 4.221632 0.530922
H  -1.044173 -4.458002 -0.628095
H  -3.535552 -4.28528 -0.494291
H  4.926842 1.042527 -0.828895
H  4.186909 -0.604968 -0.973533
H  4.900854 0.797457 1.690059
H  4.188081 -0.828809 1.524963
H  6.985838 0.003983 0.442586
H  6.686405 -0.977611 1.902908
H  6.267494 -1.627475 0.294813
