program: Gaussian 09
title: 000272070
version: EM64L-G09RevD.01
frameworkgroup: C1[X(C18H27N)]
method: RPBEPBE
basis: SDD
operation: Freq
keyword: #pfreq=noraman
keyword: PBEPBE/SDD
title: #p freq=noraman PBEPBE/SDD
converged: YES YES NO NO
title: Mulliken charges:
elementType: N C C C C C C C C C C C C C C C C C C H H H H H H H H H H H H H H H H H H H H H H H H H H H
charge: -0.109714 0.069008 -0.529371 -0.158527 -0.482368 -0.487251 0.062961 -0.475608 -0.478129 -0.498949 0.286448 -0.576334 0.282649 -0.435979 -0.425802 -0.636430 -0.635421 -0.246496 -0.235499 0.213695 0.194451 0.210665 0.240038 0.199433 0.190911 0.192601 0.206788 0.161683 0.204366 0.212605 0.209850 0.205257 0.215582 0.217831 0.223043 0.221513 0.233285 0.238080 0.240188 0.184364 0.213327 0.239392 0.213196 0.184329 0.221816 0.222519
chargesum: 0.00000
title: Mulliken charges with hydrogens summed into heavy atoms:
elementType: N C C C C C C C C C C C C C C C C C C
charge: -0.109714 0.282703 -0.124255 0.081511 -0.092024 -0.087862 0.224645 -0.058636 -0.063022 -0.065535 0.286448 -0.131778 0.282649 -0.202694 -0.187722 0.001450 0.001496 -0.024680 -0.012980
polarizability: 2.60505844e+02 -5.78031049e+00 1.80054816e+02 7.77383289e-01 9.26613153e+00 1.42974659e+02
1716.lowfreq: -6.9625 -5.2819 -0.0007 -0.0004 0.0005 16.2721 28.4505 32.0609 43.0209
frequency: 28.3929 32.0160 42.8854 52.8310 86.2853 102.4926 145.3076 167.0580 185.0296 201.1476 210.2268 220.0353 240.5231 261.9230 295.5817 312.3200 365.1543 386.7655 413.9874 416.1013 427.4965 443.5215 453.9696 462.7829 488.9429 513.8041 530.4056 573.2662 603.4871 622.5115 720.6107 744.4612 760.0705 773.0488 787.2246 790.9075 833.5198 842.1609 863.7346 878.1991 897.0168 913.1704 934.7544 939.7475 957.6902 972.3724 982.6750 984.4878 1019.3961 1022.7858 1026.8849 1029.6655 1056.5592 1064.2866 1071.1495 1085.5878 1088.9012 1101.5620 1109.9434 1117.2286 1127.0465 1140.9830 1156.2242 1161.5195 1169.7071 1190.5857 1199.1601 1207.6673 1227.7008 1231.5729 1238.3781 1247.4125 1260.1673 1263.3427 1264.5288 1281.1079 1291.1702 1303.3552 1305.7398 1307.6654 1318.9795 1324.6751 1334.0085 1340.6433 1349.9863 1351.8411 1375.8687 1387.3214 1415.8172 1444.4349 1445.1407 1455.1231 1459.1761 1460.1318 1462.2544 1470.2392 1471.6178 1473.2274 1475.1131 1476.0371 1476.5139 1482.7115 1492.4441 1594.0129 1616.2329 2780.4902 2838.4054 2855.0010 2935.2399 2941.8704 2947.9121 2951.5081 2960.6688 2969.7015 2976.1480 2980.4913 2987.1224 3007.8708 3017.1537 3025.2820 3032.3445 3035.1681 3041.2251 3044.1342 3049.6189 3066.0510 3089.7700 3094.4811 3114.9332 3121.5962 3135.8857 3156.2198
redmass: 3.9092 3.0227 4.0284 2.6375 3.5100 3.4642 3.1424 2.8953 2.0475 2.1067 1.7383 1.6288 1.8650 1.6318 2.1388 2.2063 3.0252 2.7374 2.2006 2.7010 2.8740 2.2967 2.3137 3.1301 2.4092 3.5968 3.0449 3.3842 3.4227 3.1049 3.2308 2.2052 1.8223 2.1606 1.4798 1.9959 3.0203 2.8311 1.8514 1.6656 1.3691 1.7541 1.9485 1.6232 1.8557 2.1225 1.6155 1.8670 2.5543 2.1659 1.6071 1.8120 1.4599 1.8915 2.1215 1.3184 2.0670 1.4070 2.3297 2.3433 1.4956 2.2287 1.8854 1.5909 1.1032 1.4853 1.5817 1.6255 1.6833 1.6180 1.9258 1.3639 1.5343 1.2630 1.3213 1.4532 1.3932 1.4084 1.2149 1.3567 1.4113 1.2678 1.5859 1.5506 1.6626 1.5299 1.4886 6.4751 1.1393 2.3585 1.1805 1.1165 1.0808 1.2242 1.0877 1.0805 1.0804 1.1738 1.2247 1.5041 1.0502 1.0686 1.0489 6.8750 7.0369 1.0794 1.0579 1.0580 1.0809 1.0768 1.0609 1.0626 1.0654 1.0657 1.0622 1.0629 1.0651 1.0997 1.0965 1.0965 1.0732 1.0730 1.0949 1.1002 1.1000 1.1014 1.0986 1.0990 1.0851 1.0893 1.0942 1.1002
irintensity: 0.1257 0.2809 0.0644 0.5745 0.1622 0.0139 0.3872 0.3190 0.0968 0.7499 0.7913 1.0883 2.9046 1.7456 2.3187 4.6941 1.2516 1.1186 1.5442 0.9662 1.7286 3.0785 1.1800 1.1168 4.3629 0.4990 5.1365 1.0446 0.5627 0.8794 2.5098 23.6337 45.5615 17.8190 0.4302 2.5766 8.9713 5.0617 9.1828 0.8160 6.8653 4.4916 1.7350 1.1689 3.6824 2.8898 0.7981 1.0052 23.5162 18.0946 12.5063 4.3241 4.9616 13.0112 3.5052 2.5220 3.2390 2.2971 2.4060 0.8593 8.8436 3.1083 3.5560 0.3556 0.3493 0.9836 8.7957 4.0944 1.2703 1.1030 5.0306 0.8361 0.2523 0.9009 1.6452 2.1870 0.4363 2.2921 1.0013 2.0423 3.0467 0.8550 1.3081 2.7435 6.1475 0.4187 20.6777 4.0811 1.0417 5.8523 7.8179 0.4521 17.5207 4.4385 9.2190 28.1520 1.6271 9.7952 6.6302 13.8076 7.8537 1.3557 42.6203 0.4910 2.9048 70.1721 73.3556 199.2711 14.2540 2.5129 6.6655 30.7394 77.6979 35.9630 16.2836 27.5213 35.1728 12.5771 79.7564 58.4828 13.2752 93.7917 31.7916 29.9064 81.1197 50.8422 38.7877 36.0818 6.4005 4.6983 39.5755 37.6964
temp: 298.150 k
press: 1.00000 atm
elementType: 7 6 6 6 6 6 6 6 6 6 6 6 6 6 6 6 6 6 6 1 1 1 1 1 1 1 1 1 1 1 1 1 1 1 1 1 1 1 1 1 1 1 1 1 1 1
symmnumber: 1
zpe: 1072697.0 jmol-1
zpe.correction: 0.408569 hartree
zpe.thermalcorrener: 0.427042 hartree
zpe.thermalcorrenthalpy: 0.427986 hartree
zpe.thermalcorrgfe: 0.361178 hartree
zpe.sumelectzpe: -755.393539 hartree
zpe.sumelectthermal: -755.375066 hartree
zpe.sumelectthermalent: -755.374122 hartree
zpe.sumelectthermalfe: -755.440930 hartree
dipole: -0.7367 -0.1748 -0.3768
dipole: 0.8457
quadrupole: -114.9143 -113.8417 -118.4052
quadrupole: 4.8528 3.5879 1.0248
quadrupole: 0.8061 1.8787 -2.6848 4.8528 3.5879 1.0248
hfenergy: -755.8021077 hartree
pointgroup: C01 [X(C18H27N1)]
dipole: 0.2864684 -0.0644032 0.1564859 debye
polarizability: 260.5275135|5.4214855|179.1048553|2.6459897|-10.7368203|143.90295 unknown
InChI: InChI=1S/C18H27N/c1-19(2)17-11-7-14(8-12-17)13-16-10-9-15-5-3-4-6-18(15)16/h3-6,14,16-17H,7-13H2,1-2H3
charge 0 multiplicity 1
46 atoms
N  5.351193 0.255596 0.099593
C  0.98348 -0.149735 -0.408408
C  -0.469425 -0.676315 -0.296854
C  -1.519506 0.379988 0.121286
C  1.920923 -1.244719 -0.970978
C  1.548447 0.347325 0.943674
C  3.956186 -0.265266 0.260156
C  3.387229 -0.770467 -1.090874
C  3.014993 0.826149 0.832614
C  -1.655031 1.582021 -0.870755
C  -2.956425 -0.14205 0.198201
C  -3.122623 2.085763 -0.719172
C  -3.871114 0.832463 -0.282262
C  -3.426105 -1.379398 0.683682
C  -5.256435 0.575818 -0.286051
C  6.277992 -0.734933 -0.495806
C  5.920647 0.789736 1.358712
C  -4.818954 -1.641749 0.677859
C  -5.729019 -0.670931 0.195403
H  0.995834 0.704646 -1.120494
H  -0.481854 -1.516065 0.430467
H  -0.776478 -1.103217 -1.274592
H  -1.243325 0.773395 1.12442
H  1.559946 -1.577296 -1.964727
H  1.872374 -2.133125 -0.304893
H  1.484091 -0.481241 1.68178
H  0.931732 1.175286 1.344053
H  3.954069 -1.133164 0.980075
H  3.995267 -1.606978 -1.481083
H  3.461015 0.058479 -1.823984
H  3.077735 1.711697 0.167789
H  3.354291 1.146547 1.834578
H  -1.499808 1.20745 -1.902062
H  -0.911585 2.377307 -0.686668
H  -3.522359 2.531439 -1.648194
H  -3.189445 2.864774 0.068171
H  -2.727482 -2.137666 1.056823
H  -5.963735 1.326209 -0.659569
H  5.981025 -0.981051 -1.527684
H  6.3403 -1.690216 0.087554
H  7.29121 -0.297467 -0.539898
H  5.36069 1.675346 1.69902
H  6.962121 1.108349 1.175323
H  5.931114 0.040692 2.192652
H  -5.195002 -2.603145 1.046567
H  -6.803693 -0.886986 0.191957
