program: Gaussian 09
title: 000272066
version: EM64L-G09RevD.01
frameworkgroup: C1[X(C21H15NO2)]
method: RPBEPBE
basis: SDD
operation: Freq
keyword: #p
keyword: freq=noraman
keyword: PBEPBE/SDD
title: #p freq=noraman PBEPBE/SDD
converged: YES YES NO NO
title: Mulliken charges:
elementType: O O N C C C C C C C C C C C C C C C C C C C C C H H H H H H H H H H H H H H H
charge: -0.152549 -0.243704 -0.468819 0.129824 0.259116 0.227231 0.189605 0.161057 -0.329227 -0.423629 -0.371578 -0.356576 -0.424366 -0.229395 0.062440 -0.237403 -0.231278 0.491061 -0.349604 -0.442672 0.451626 -0.351473 -0.405868 -0.808228 0.285184 0.282523 0.270693 0.283307 0.242743 0.237497 0.239569 0.329684 0.307186 0.224260 0.231762 0.232390 0.233522 0.222972 0.231113
chargesum: 0.00000
title: Mulliken charges with hydrogens summed into heavy atoms:
elementType: O O N C C C C C C C C C C C C C C C C C C C C C
charge: -0.152549 -0.243704 -0.139134 0.129824 0.259116 0.227231 0.189605 0.161057 -0.329227 -0.138445 -0.089055 -0.085882 -0.141059 0.013348 0.062440 0.000094 0.008291 0.491061 -0.042417 -0.218412 0.451626 -0.119711 -0.173477 -0.120621
polarizability: 3.55969975e+02 -2.06772036e+01 2.86621442e+02 2.56405493e+01 8.42968624e+00 1.30334563e+02
1716.lowfreq: -2.2848 0.0004 0.0005 0.0006 1.2511 6.0213 20.2348 24.7172 29.0581
frequency: 19.8245 24.6603 29.0098 38.0143 72.6162 85.1473 115.8561 120.2604 149.7245 162.8770 195.7160 211.5436 261.1129 278.3103 281.5577 305.5240 344.7421 351.7059 383.4495 406.9271 409.1874 420.0102 442.9865 474.4750 509.5802 522.3735 546.2904 558.3003 576.6835 624.0340 634.8822 662.2667 663.9106 677.1418 716.5363 726.1390 736.2513 755.4286 762.9872 780.0507 786.2954 801.8086 822.2711 836.2864 854.3152 862.8379 873.9608 911.0757 944.3107 947.4938 954.8495 977.0383 987.4887 988.4048 991.8383 998.9970 1002.9047 1009.1891 1029.7132 1047.4007 1073.3261 1084.8066 1107.8162 1129.2548 1168.6226 1172.7548 1188.4567 1192.2500 1210.3271 1222.8239 1242.6903 1258.2371 1263.4102 1295.2084 1312.9043 1364.4547 1370.1422 1393.9780 1398.5370 1409.8829 1426.8184 1451.0034 1457.6731 1468.9011 1470.0824 1471.5091 1502.3741 1509.1784 1572.8857 1590.9925 1594.0095 1602.4712 1604.8185 1613.6912 1626.6500 1634.0763 2976.1571 3054.1721 3082.7394 3108.0285 3126.4701 3136.0791 3138.9660 3143.4221 3148.9090 3155.3928 3164.5578 3171.4274 3177.2268 3193.0155 3513.5347
redmass: 1.2331 2.7568 4.3941 6.1758 7.2040 4.8481 4.3244 5.0573 6.1950 5.7478 4.8058 4.6092 6.0452 6.8543 4.6549 5.2765 5.6560 4.0261 3.8018 4.1614 3.9473 3.8251 4.0850 5.2206 4.1080 3.2781 6.2531 3.6716 5.4171 7.1082 7.0350 3.4369 1.4411 5.4053 3.0769 4.6808 5.4246 1.4807 5.8890 5.8373 1.9583 2.4094 1.4694 5.4587 1.3011 2.8330 7.1105 1.4584 1.3588 6.1139 1.4548 1.4557 1.3859 1.3603 6.7418 1.3982 1.3602 2.9054 2.1519 1.5446 1.8917 2.4245 2.5814 1.3398 1.7545 1.2120 1.5544 1.1505 2.1783 2.5848 3.5699 2.6109 2.0636 1.5524 1.4511 6.0499 6.0386 2.5290 1.2388 3.8137 2.9552 2.7685 2.9259 2.5274 1.1288 1.2600 1.9038 2.8800 7.3240 7.7309 7.0243 4.0530 7.2266 7.1932 6.3675 10.7035 1.0372 1.0976 1.0989 1.0882 1.0909 1.0862 1.0959 1.0869 1.0913 1.0924 1.0967 1.0995 1.0970 1.0944 1.0765
irintensity: 0.7545 0.3532 0.5156 0.7058 7.7874 2.8383 1.3969 2.0845 0.6479 2.8243 1.0750 1.1811 3.3276 2.1593 0.2891 6.3485 3.2646 0.3118 1.8109 0.8858 1.6761 1.9160 5.5414 8.2801 9.3308 21.1305 1.2593 0.4966 1.8054 0.9974 0.4037 2.2172 83.5881 4.9037 2.5240 11.6498 2.1936 107.5981 1.6334 6.2644 3.8875 4.5240 58.6923 2.0467 18.0061 17.1439 24.8993 3.1329 2.6539 27.7832 1.0867 3.6338 1.1893 2.9481 1.7969 1.5983 0.8062 2.6681 0.2735 11.6144 11.6282 16.3540 36.7074 14.7305 5.8307 0.9102 7.0837 0.2444 11.1315 3.0432 41.8258 23.3324 40.5588 21.1265 34.8427 40.0327 85.3708 13.6957 2.6327 29.0896 17.6554 2.5509 29.9956 11.1964 17.9087 50.5758 96.3746 316.8745 47.5343 94.0425 7.6831 111.7702 32.8555 84.2238 5.7024 124.4201 45.9892 20.1743 18.9629 20.2687 23.4545 1.3540 15.6736 1.4328 4.5316 1.3134 19.5731 17.5496 10.2492 4.8180 10.8335
temp: 298.150 k
press: 1.00000 atm
elementType: 8 8 7 6 6 6 6 6 6 6 6 6 6 6 6 6 6 6 6 6 6 6 6 6 1 1 1 1 1 1 1 1 1 1 1 1 1 1 1
symmnumber: 1
zpe: 786028.4 jmol-1
zpe.correction: 0.299382 hartree
zpe.thermalcorrener: 0.318902 hartree
zpe.thermalcorrenthalpy: 0.319846 hartree
zpe.thermalcorrgfe: 0.248863 hartree
zpe.sumelectzpe: -1012.846037 hartree
zpe.sumelectthermal: -1012.826517 hartree
zpe.sumelectthermalent: -1012.825573 hartree
zpe.sumelectthermalfe: -1012.896556 hartree
dipole: -3.0059 2.1572 1.4056
dipole: 3.9579
quadrupole: -141.6117 -124.4435 -142.4756
quadrupole: -10.7868 -3.0730 -4.8226
quadrupole: -5.4348 11.7335 -6.2986 -10.7868 -3.0730 -4.8226
hfenergy: -1013.1454189 hartree
pointgroup: C01 [X(C21H15N1O2)]
dipole: 1.1541467 -0.7851701 0.6900732 debye
polarizability: 349.9051899|-32.9098247|279.0733817|-30.6503877|-39.2696091|143.9474085 unknown
InChI: InChI=1S/C21H15NO2/c1-13-9-11-14(12-10-13)22-21(24)18-8-4-7-17-19(18)15-5-2-3-6-16(15)20(17)23/h2-12,22H,1H3
charge 0 multiplicity 1
39 atoms
O  -5.06735 -0.067164 1.059011
O  1.205471 2.030097 -1.833162
N  1.332001 0.702525 0.104894
C  -1.738315 0.736192 -0.1024
C  -1.6787 -0.760601 0.016863
C  -3.067662 1.14613 0.238523
C  -2.947339 -1.221806 0.490414
C  -0.802887 1.723109 -0.500528
C  -3.870534 -0.052097 0.65795
C  -3.495511 2.477173 0.156114
C  -0.681263 -1.707352 -0.2950
C  -1.255085 3.071568 -0.627967
C  -3.222895 -2.581831 0.693798
C  -2.573077 3.451103 -0.304472
C  0.655057 1.487549 -0.825904
C  -0.957372 -3.087281 -0.09528
C  -2.206281 -3.526449 0.403419
C  2.692184 0.274145 0.096003
C  3.611676 0.619942 -0.930876
C  3.126245 -0.542619 1.173147
C  5.389491 -0.673044 0.209577
C  4.935873 0.143111 -0.859571
C  4.456368 -1.005973 1.223901
C  6.825369 -1.164646 0.263391
H  -4.52336 2.738133 0.428458
H  0.287612 -1.410198 -0.704023
H  -0.5366 3.814543 -0.989395
H  -4.208464 -2.891766 1.056692
H  -2.877208 4.497701 -0.405405
H  -0.184074 -3.82389 -0.339796
H  -2.389381 -4.596051 0.550006
H  0.781141 0.391417 0.909884
H  3.279892 1.25174 -1.756471
H  2.423769 -0.815527 1.971797
H  5.636805 0.416239 -1.658109
H  4.772873 -1.634677 2.064439
H  7.536766 -0.320375 0.337803
H  6.995849 -1.82323 1.132341
H  7.091916 -1.732541 -0.647662
