program: Gaussian 09
title: 000272067
version: EM64L-G09RevD.01
frameworkgroup: C1[X(C16H16O2)]
method: RPBEPBE
basis: SDD
operation: Freq
keyword: #pfreq=noraman
keyword: PBEPBE/SDD
title: #p freq=noraman PBEPBE/SDD
converged: YES YES NO NO
title: Mulliken charges:
elementType: O O C C C C C C C C C C C C C C C C H H H H H H H H H H H H H H H H
charge: -0.267611 -0.252460 0.273194 0.116726 0.359313 0.050770 -0.387937 0.103534 -0.377093 -0.688522 -0.688971 -0.414572 -0.390802 -0.231805 -0.234550 -0.231784 -0.240567 -0.248269 0.227760 0.252042 0.267355 0.203345 0.248525 0.221785 0.211870 0.254950 0.220926 0.244239 0.245985 0.231675 0.235842 0.225488 0.229833 0.229787
chargesum: 0.00000
title: Mulliken charges with hydrogens summed into heavy atoms:
elementType: O O C C C C C C C C C C C C C C C C
charge: -0.267611 -0.252460 0.273194 0.116726 0.359313 0.278529 -0.135894 0.103534 -0.109738 -0.014868 -0.001225 -0.170334 -0.144817 -0.000130 0.001292 -0.006295 -0.010734 -0.018482
polarizability: 2.24830288e+02 -2.28275056e+01 1.82296423e+02 -1.15244395e+01 -2.02338730e+01 1.24429205e+02
1716.lowfreq: -9.7722 -4.2532 0.0003 0.0006 0.0007 3.6874 28.1465 43.7906 52.3368
frequency: 27.9053 43.7736 52.3124 70.9705 87.0569 99.9254 109.1887 168.5887 180.3988 203.0839 230.9281 239.7212 284.6264 306.2353 334.7924 373.7837 391.2049 405.9301 419.7695 446.3083 511.7231 530.4424 562.7708 612.5404 614.9700 651.0132 688.6154 704.8372 739.7087 750.6470 765.5717 782.3381 793.1259 815.7769 855.4381 888.8109 901.4503 923.3649 926.7603 939.8125 966.9560 977.9522 987.6451 994.6735 995.7964 996.3779 1031.4681 1035.8975 1077.4913 1080.2900 1102.5226 1112.1321 1155.3051 1171.8127 1176.1269 1181.8180 1190.0596 1234.9302 1265.3961 1289.5013 1315.3302 1323.1632 1332.8518 1369.0120 1372.7738 1376.8214 1395.8531 1424.2218 1437.9242 1454.4038 1464.6748 1465.7093 1472.5609 1487.6296 1494.8805 1568.3038 1583.9652 1597.8717 1607.5173 1611.7311 2988.4122 2992.0878 3021.6528 3082.7211 3091.5874 3100.0156 3105.3073 3120.7634 3125.0904 3129.3982 3137.4038 3142.0253 3147.1090 3153.8761 3163.2908 3168.7181
redmass: 3.4539 4.0065 3.8209 4.3118 4.1686 4.8007 4.4398 3.0385 1.1454 2.2137 3.2536 1.6720 4.1253 4.7150 4.5066 4.6374 3.0138 2.8693 3.6039 2.9152 3.6160 4.0333 3.4292 6.8393 6.4752 6.6344 4.8859 1.8065 5.9294 2.0171 3.0039 1.7054 2.8022 6.5389 1.2463 1.4191 2.6079 1.4213 1.2281 1.3569 1.3985 1.4004 5.6903 1.3330 4.6979 1.4447 2.7314 2.8039 2.1585 1.8474 1.7240 1.7609 2.0357 1.0530 1.0626 1.9473 1.1154 2.4608 1.8914 2.1316 1.3758 1.5793 1.3207 6.5200 7.5641 1.2535 1.2336 2.2644 2.3147 1.0529 1.0503 2.2464 1.0502 1.0517 2.8185 6.6923 6.4625 9.1119 6.8461 6.1906 1.0356 1.0359 1.0863 1.0993 1.0987 1.1005 1.1006 1.0847 1.0874 1.0856 1.0921 1.0898 1.0965 1.0946 1.1016 1.1006
irintensity: 0.2565 0.1986 1.3871 1.1582 1.3422 0.5484 1.1181 0.5037 0.1156 2.9650 0.3035 2.9533 0.3689 3.2069 1.5750 3.6010 2.0184 0.0785 3.0382 2.2100 6.5427 6.8681 2.5403 3.0938 0.8456 5.0198 26.2164 35.6976 4.5174 92.4637 10.3850 29.7867 21.0446 3.2780 0.7001 0.8183 12.4644 2.9230 2.0940 0.1524 2.0118 0.6585 0.1281 0.3550 5.7326 0.5309 44.6272 82.5681 105.0973 40.2452 55.0988 27.9392 11.5006 0.0224 0.6244 30.6513 0.3883 181.1618 57.4892 7.0310 1.3743 6.8068 3.2698 9.3383 0.4219 32.8238 16.8709 10.2593 12.7204 6.3845 8.4614 21.9150 6.3859 21.1579 0.9021 6.4029 30.8281 145.4926 42.7322 1.3351 14.1686 26.6718 6.7841 4.1292 54.5568 14.7056 24.0489 3.9954 0.3315 2.3467 17.9232 4.5080 34.5524 14.7350 26.1134 24.8460
temp: 298.150 k
press: 1.00000 atm
elementType: 8 8 6 6 6 6 6 6 6 6 6 6 6 6 6 6 6 6 1 1 1 1 1 1 1 1 1 1 1 1 1 1 1 1
symmnumber: 1
zpe: 719476.2 jmol-1
zpe.correction: 0.274034 hartree
zpe.thermalcorrener: 0.290712 hartree
zpe.thermalcorrenthalpy: 0.291656 hartree
zpe.thermalcorrgfe: 0.228615 hartree
zpe.sumelectzpe: -768.478206 hartree
zpe.sumelectthermal: -768.461528 hartree
zpe.sumelectthermalent: -768.460584 hartree
zpe.sumelectthermalfe: -768.523625 hartree
dipole: -0.7730 1.3741 -1.4792
dipole: 2.1619
quadrupole: -88.7244 -103.7799 -107.1133
quadrupole: 1.3991 -3.7508 1.4941
quadrupole: 11.1481 -3.9074 -7.2408 1.3991 -3.7508 1.4941
hfenergy: -768.7522402 hartree
pointgroup: C01 [X(C16H16O2)]
dipole: -0.374218 0.6592229 -0.3858131 debye
polarizability: 217.1926717|-19.862896|188.0836505|-32.3936526|-1.9348268|126.2795937 unknown
InChI: InChI=1S/C16H16O2/c1-12(2)18-16(17)15-11-7-6-10-14(15)13-8-4-3-5-9-13/h3-12H,1-2H3
charge 0 multiplicity 1
34 atoms
O  -0.957479 -1.342362 -0.265165
O  0.356906 -2.939299 0.816283
C  1.263343 0.559179 0.063445
C  1.375823 -0.865289 0.023432
C  0.057895 1.281098 0.573454
C  -2.18127 -2.209629 -0.086025
C  2.399713 1.326014 -0.311561
C  0.237613 -1.813563 0.264943
C  2.612682 -1.473709 -0.315652
C  -3.366533 -1.244282 -0.153681
C  -2.187503 -3.288965 -1.178188
C  -0.485817 2.37834 -0.144026
C  -0.521497 0.932436 1.82307
C  3.613941 0.71553 -0.689229
C  3.729548 -0.693622 -0.674179
C  -1.59127 3.096611 0.362826
C  -1.620851 1.653437 2.334648
C  -2.163737 2.737979 1.60512
H  -2.096779 -2.682054 0.910916
H  2.333303 2.418565 -0.263783
H  2.671449 -2.566966 -0.306632
H  -4.309204 -1.795542 0.017503
H  -3.272609 -0.454727 0.610974
H  -3.418733 -0.761683 -1.145462
H  -3.100544 -3.906391 -1.090311
H  -1.311961 -3.951836 -1.079776
H  -2.178276 -2.82377 -2.17992
H  -0.058293 2.649118 -1.11647
H  -0.093625 0.105985 2.40282
H  4.4720 1.336802 -0.968816
H  4.674736 -1.176815 -0.94298
H  -2.006151 3.932528 -0.211671
H  -2.047166 1.377334 3.30578
H  -3.017558 3.298347 2.002212
