program: Gaussian 09
title: 000272046
version: EM64L-G09RevD.01
frameworkgroup: C1[X(C5H10N6O2)]
method: RPBEPBE
basis: SDD
operation: Freq
keyword: #p
keyword: freq=noraman
keyword: PBEPBE/SDD
title: #p freq=noraman PBEPBE/SDD
converged: YES YES NO NO
title: Mulliken charges:
elementType: O O N N N N N N C C C C C H H H H H H H H H H
charge: -0.458224 -0.474753 -0.128776 -0.416539 -0.089382 -0.646447 -0.651530 -0.613848 0.054537 0.367568 0.132598 0.155440 -0.361151 0.293499 0.231049 0.225876 0.330327 0.351115 0.318492 0.346080 0.353558 0.326761 0.353751
chargesum: 0.00000
title: Mulliken charges with hydrogens summed into heavy atoms:
elementType: O O N N N N N N C C C C C
charge: -0.458224 -0.121002 -0.128776 -0.123041 -0.089382 0.034995 0.013042 0.066470 0.054537 0.367568 0.132598 0.155440 0.095775
polarizability: 1.52838619e+02 4.63845152e+00 1.29058281e+02 9.45624918e+00 -8.07386846e-02 5.82816885e+01
1716.lowfreq: -15.8793 -8.3396 -0.0004 0.0001 0.0004 6.0173 50.0910 86.3123 132.3696
frequency: 50.0302 86.2606 132.3630 145.2091 183.5176 205.1201 219.8356 255.1523 305.5003 312.0662 323.3044 357.7361 390.9068 450.8342 462.0382 485.5708 498.7544 516.2989 539.3061 570.5704 608.2429 623.0355 631.0988 645.6163 653.8011 672.7101 678.1872 719.6217 728.4023 831.2388 850.0658 958.1018 993.8617 1089.8681 1126.7818 1142.4652 1145.4778 1167.2874 1213.7413 1269.2930 1302.8995 1336.8821 1376.9440 1420.1945 1438.0877 1454.9917 1478.1771 1488.3437 1521.6773 1551.0989 1596.5623 1621.6312 1645.1122 3014.1042 3102.6671 3441.3551 3454.7458 3470.4551 3471.8549 3563.9655 3655.3621 3680.5977 3700.9349
redmass: 5.0251 3.9011 4.3433 6.3982 3.7558 2.1472 2.2430 4.1521 3.0562 2.8558 4.6749 4.5071 2.8126 2.2067 1.2975 3.6078 1.4714 1.3068 4.0942 1.8779 3.0040 2.4470 3.5770 2.0382 2.1467 2.0523 3.2620 1.4609 3.6267 5.8605 2.6754 2.2197 1.3832 2.5804 2.2678 4.6290 2.6310 2.9638 1.5073 3.4862 1.1979 4.5731 1.1460 4.7045 1.1362 1.2321 1.4879 1.5171 5.0503 2.3882 3.4165 1.5253 6.1227 1.0598 1.1085 1.0533 1.0493 1.0509 1.0738 1.0669 1.0972 1.0983 1.0983
irintensity: 8.1502 1.2473 8.4694 14.8386 61.6581 81.2680 106.5604 7.1447 4.4217 21.4813 28.0509 11.4812 8.3216 17.2941 135.3000 48.1562 18.5111 329.5329 28.6480 104.0388 34.6590 33.4574 15.9740 45.8680 49.5986 20.7182 14.5015 82.2279 68.7269 136.6094 17.4790 22.7508 7.8243 33.2155 0.3500 43.3359 109.2588 12.6130 30.9644 32.2403 5.6578 33.0375 6.5459 130.3876 3.6816 16.7160 58.8126 29.5980 131.8744 23.5943 676.9389 383.9168 331.7663 48.2729 30.9285 199.3029 54.3432 97.3106 8.1610 7.1070 75.6320 82.6136 86.3283
temp: 298.150 k
press: 1.00000 atm
elementType: 8 8 7 7 7 7 7 7 6 6 6 6 6 1 1 1 1 1 1 1 1 1 1
symmnumber: 1
zpe: 466710.6 jmol-1
zpe.correction: 0.177761 hartree
zpe.thermalcorrener: 0.190708 hartree
zpe.thermalcorrenthalpy: 0.191652 hartree
zpe.thermalcorrgfe: 0.139333 hartree
zpe.sumelectzpe: -674.476939 hartree
zpe.sumelectthermal: -674.463992 hartree
zpe.sumelectthermalent: -674.463048 hartree
zpe.sumelectthermalfe: -674.515367 hartree
dipole: -2.8141 -0.2879 0.1055
dipole: 2.8308
quadrupole: -79.5604 -66.2937 -74.7563
quadrupole: -10.2038 0.2882 -2.6787
quadrupole: -6.0236 7.2431 -1.2195 -10.2038 0.2882 -2.6787
hfenergy: -674.6547 hartree
pointgroup: C01 [X(C5H10N6O2)]
dipole: -1.0199948 0.4310542 -0.1189428 debye
dipolederiv: -0.6696076 0.3132868 -0.0208625 0.3537465 -0.8767423 0.0370976 -0.0211623 0.0354674 -0.3970842 -0.7311086 0.0270511 -0.2996484 0.1116391 -0.6922207 0.3377307 -0.4854662 0.2232555 -0.5597432 -0.5283629 -0.6583075 0.2285751 -0.8717152 0.1133636 0.1453281 0.2969206 0.1092341 -0.048574 -0.7207264 0.1095126 -0.2405205 -0.0872774 -0.4904561 0.256074 -0.2581617 0.2747916 -0.4089722 -1.157377 0.3132211 0.0701769 0.2488269 -0.6555089 0.027881 0.0868134 0.0509783 -0.2981192 -0.4161491 -0.3728062 0.0133026 -0.3725458 -1.1777338 0.2075687 0.0002013 0.1693493 -0.6748651 -0.7058966 0.577009 -0.0930237 0.5612771 -1.2730407 -0.012808 -0.0451504 -0.1195812 -0.6559016 -1.5500066 -0.1135905 0.1534687 -0.0488413 -0.2259884 -0.0801814 0.1745674 -0.075236 -0.7138402 0.2730431 -0.0674197 -0.0414924 0.0468798 -0.6821748 0.0658964 -0.25296 0.0958143 -0.1810933 0.6818675 0.297698 -0.1600526 0.2952324 1.294905 -0.3380034 -0.1316563 -0.3173315 0.258719 0.9281572 -0.4565 -0.073002 -0.5056283 1.4380051 -0.1459296 -0.0492539 -0.1676186 0.2038008 1.89153 0.0508634 -0.2933501 0.1052514 0.6319203 -0.1073772 -0.3284641 -0.0844186 0.255359 0.7800293 -0.129117 0.3263618 -0.0947826 0.6787999 -0.3500934 0.6227095 -0.3602257 0.8055795 -0.0024584 0.0097389 0.0023611 0.0391604 0.2122093 -0.1825911 0.0198055 -0.0661548 0.1590122 -0.1624141 -0.040628 0.0471967 0.0039396 0.0427272 0.0505029 0.0824259 0.060557 0.0240353 0.1040276 0.0678781 0.0392171 0.0249632 -0.0886449 -0.0448055 -0.0348142 -0.058377 -0.0708239 0.2212958 0.0543708 0.0279523 0.0085007 0.2915686 -0.0050407 0.04016 0.0159174 0.3486592 0.2550869 0.0823888 0.0081293 -0.0157114 0.3295706 0.0118567 0.0280972 0.0045888 0.3579966 0.1419524 -0.0093072 0.0134114 -0.0356488 0.2691179 0.0320206 0.0306336 0.0493845 0.348123 0.416337 -0.0296419 0.0643915 0.0604633 0.2334407 0.0570103 0.0224998 0.1348146 0.329221 0.3486497 -0.040574 0.0142086 0.0447374 0.2300556 0.0190092 -0.0072179 0.0356665 0.3714582 0.297978 0.0231847 0.0150835 0.0610309 0.1863601 0.0310335 0.0047662 0.0361809 0.3876378 0.304153 -0.0083114 0.1981159 0.0665023 0.2104667 -0.0121795 0.2047066 -0.0470568 0.1594153 unknown
polarizability: 147.282667|-13.1265566|131.0698448|-8.7660816|-14.8672477|61.826077 unknown
InChI: InChI=1S/C5H10N6O2/c6-3-2(9-1-12)4(7)11(13)5(8)10-3/h9,12H,1,6-8H2
charge 0 multiplicity 1
23 atoms
O  2.193836 -2.223031 0.26876
O  -3.410636 1.224249 -0.893126
N  1.396495 -1.097345 0.193643
N  -2.159719 -0.120224 0.782345
N  1.216175 1.277906 -0.232495
N  -0.378121 -2.424998 0.84963
N  -0.844051 2.387211 -0.060179
N  3.28598 0.09473 -0.381973
C  -0.772593 -0.017792 0.405667
C  0.040512 -1.1789 0.488326
C  -0.132403 1.206514 0.030923
C  1.942236 0.142999 -0.144176
C  -3.1974 -0.109746 -0.219902
H  -2.410418 0.346633 1.661268
H  -4.166108 -0.321684 0.260057
H  -2.973775 -0.864672 -0.995352
H  -1.341569 -2.571588 1.13471
H  0.357813 -3.139658 0.870558
H  -0.32952 3.232105 -0.297537
H  -1.868558 2.361571 -0.081176
H  3.713734 -0.831035 -0.277309
H  3.791127 0.937593 -0.632926
H  -2.917937 1.238861 -1.753038
