program: Gaussian 09
title: 000272048
version: EM64L-G09RevD.01
frameworkgroup: C1[X(C15H11NO2)]
method: RPBEPBE
basis: SDD
operation: Freq
keyword: #p
keyword: freq=noraman
keyword: PBEPBE/SDD
title: #p freq=noraman PBEPBE/SDD
converged: YES YES NO NO
title: Mulliken charges:
elementType: O O N C C C C C C C C C C C C C C C H H H H H H H H H H H
charge: -0.156666 -0.290011 -0.380298 0.149835 0.269918 0.205619 0.198721 -0.321133 0.206947 -0.428808 -0.359636 -0.427485 -0.389941 -0.237885 0.146848 -0.243215 -0.227292 -0.611474 0.285488 0.312617 0.280025 0.249990 0.239990 0.232261 0.235543 0.322769 0.230550 0.229199 0.277524
chargesum: 0.00000
title: Mulliken charges with hydrogens summed into heavy atoms:
elementType: O O N C C C C C C C C C C C C C C C
charge: -0.156666 -0.290011 -0.057528 0.149835 0.269918 0.205619 0.198721 -0.321133 0.206947 -0.143321 -0.047019 -0.147461 -0.139951 0.002105 0.146848 -0.010954 0.008251 0.125799
polarizability: 2.40104382e+02 1.84307027e+01 2.26584648e+02 -1.05564900e+00 2.80761219e+00 7.87015790e+01
1716.lowfreq: -7.2791 -3.0058 -0.0008 -0.0003 0.0003 8.5608 45.7304 51.0540 101.6919
frequency: 45.7162 51.0456 101.6870 109.2663 121.8543 139.2370 153.3556 192.2131 243.5799 255.9614 275.6881 295.2210 331.0604 372.8311 412.6526 436.8802 443.4067 502.4412 542.8129 562.8559 580.3363 590.4999 626.7307 662.3142 679.5892 722.8665 739.3065 757.2694 766.0497 790.7061 802.4973 836.0965 860.0137 914.1947 923.8063 947.7766 978.6099 992.2705 994.2322 1003.1866 1023.1938 1035.0638 1078.9172 1086.8948 1121.0433 1135.8391 1159.4960 1171.5478 1172.9955 1196.7678 1210.5049 1248.4539 1269.4986 1297.5014 1367.2207 1392.6566 1417.0365 1428.6912 1449.3578 1453.7315 1458.6948 1473.6214 1487.1333 1512.9415 1576.1236 1593.7272 1600.7482 1605.7874 1615.1225 1634.8990 2980.9057 3061.4400 3110.9995 3129.2606 3133.1308 3147.6536 3148.1839 3163.9956 3166.4477 3179.9053 3558.4884
redmass: 4.4441 5.6511 1.1107 4.2536 3.8042 4.1466 6.4976 4.8975 4.7944 5.4271 10.2363 4.9614 4.1617 5.4461 3.9749 5.5266 4.1735 6.1929 6.9362 3.4159 4.5800 1.1854 6.9616 6.7013 5.4515 5.0247 5.2930 1.4194 6.2373 1.4646 3.8758 4.5935 3.0043 1.4652 5.6130 1.4604 1.4450 4.4240 1.5927 1.3873 2.8085 2.8157 1.9456 2.0011 1.2930 1.6912 2.1885 1.4059 1.5954 1.8569 2.2314 2.2186 2.8935 1.5107 8.3786 2.4148 1.1949 2.8559 2.2147 1.6703 2.4743 3.3760 1.0513 1.4562 7.2506 7.6686 6.7560 7.7706 7.4282 10.8236 1.0348 1.1024 1.0983 1.0874 1.0862 1.0914 1.0911 1.0982 1.0993 1.0964 1.0777
irintensity: 4.0862 5.4383 0.1997 1.6635 3.6966 2.2440 1.1505 3.9741 0.9026 1.8831 3.8628 3.8854 10.5807 9.0092 1.2262 3.9991 5.8980 0.4421 1.5810 1.5464 6.6299 102.3246 1.0936 4.2176 7.8877 1.2806 1.9814 127.9774 3.6127 0.8840 3.6480 11.5543 17.7700 0.4801 21.2322 3.2284 3.9566 1.9639 2.2711 0.9663 27.9099 11.5594 1.9022 13.8756 0.3283 69.5957 5.6052 11.2073 10.0804 24.2556 16.4732 60.8624 74.5223 7.9185 1.1462 10.6339 38.2553 30.8100 38.8305 45.7590 53.4297 6.5736 15.3638 155.9822 92.4514 32.9232 64.9078 50.4198 95.9256 117.5947 77.8496 31.4765 1.6338 5.2439 3.9204 9.4870 4.7812 27.3411 14.7500 19.2299 23.1816
temp: 298.150 k
press: 1.00000 atm
elementType: 8 8 7 6 6 6 6 6 6 6 6 6 6 6 6 6 6 6 1 1 1 1 1 1 1 1 1 1 1
symmnumber: 1
zpe: 579074.8 jmol-1
zpe.correction: 0.220558 hartree
zpe.thermalcorrener: 0.235168 hartree
zpe.thermalcorrenthalpy: 0.236113 hartree
zpe.thermalcorrgfe: 0.178518 hartree
zpe.sumelectzpe: -782.191794 hartree
zpe.sumelectthermal: -782.177183 hartree
zpe.sumelectthermalent: -782.176239 hartree
zpe.sumelectthermalfe: -782.233834 hartree
dipole: 4.4907 -0.3155 2.2359
dipole: 5.0265
quadrupole: -89.7867 -95.8061 -108.0860
quadrupole: 15.6243 7.5633 -3.7314
quadrupole: 8.1063 2.0868 -10.1931 15.6243 7.5633 -3.7314
hfenergy: -782.4123519 hartree
pointgroup: C01 [X(C15H11N1O2)]
dipole: -1.670348 0.266681 1.0244796 debye
polarizability: 240.3766893|16.4736294|223.8275211|-15.3358032|-14.1059085|81.1863985 unknown
InChI: InChI=1S/C15H11NO2/c1-16-15(18)12-8-4-7-11-13(12)9-5-2-3-6-10(9)14(11)17/h2-8,16H,1H3
charge 0 multiplicity 1
29 atoms
O  3.102447 -2.142235 0.147848
O  -2.149662 1.77286 -0.81684
N  -3.40716 0.791763 0.876983
C  -0.046042 -0.372338 -0.025353
C  0.949154 0.745189 -0.13924
C  0.687274 -1.597674 0.078624
C  2.263517 0.183179 -0.064804
C  2.162541 -1.303157 0.06523
C  -1.461974 -0.421524 0.043282
C  0.073351 -2.850498 0.195901
C  0.804741 2.135528 -0.312891
C  3.421248 0.972834 -0.131989
C  -2.084997 -1.704286 0.152392
C  -1.342015 -2.901125 0.217726
C  -2.343602 0.804309 -0.016004
C  1.975706 2.938588 -0.374093
C  3.270254 2.374079 -0.281466
C  -4.394255 1.876273 0.93456
H  0.686596 -3.75483 0.264583
H  -0.185062 2.581102 -0.433279
H  4.408803 0.503395 -0.0730
H  -3.179876 -1.760641 0.147055
H  -1.862855 -3.861716 0.284442
H  1.869849 4.021007 -0.508661
H  4.152706 3.020505 -0.336481
H  -3.457754 0.040171 1.566161
H  -4.348651 2.411172 1.901172
H  -5.419284 1.490242 0.785472
H  -4.1555 2.585426 0.12607
