program: Gaussian 09
title: 000272058
version: EM64L-G09RevD.01
frameworkgroup: C1[X(C17H15NO2)]
method: RPBEPBE
basis: SDD
operation: Freq
keyword: #p
keyword: freq=noraman
keyword: PBEPBE/SDD
title: #p freq=noraman PBEPBE/SDD
converged: YES YES NO NO
title: Mulliken charges:
elementType: O O N C C C C C C C C C C C C C C C C C H H H H H H H H H H H H H H H
charge: -0.153629 -0.257891 -0.378820 0.122015 0.258419 0.230496 0.195999 0.178663 -0.328689 -0.426052 -0.366507 -0.359002 0.096299 -0.424886 -0.229045 -0.351812 -0.233819 -0.235303 -0.348018 -0.694711 0.284310 0.277109 0.268307 0.282696 0.241512 0.211412 0.262940 0.324887 0.233218 0.238466 0.206467 0.211128 0.222426 0.226992 0.214420
chargesum: 0.00000
title: Mulliken charges with hydrogens summed into heavy atoms:
elementType: O O N C C C C C C C C C C C C C C C C C
charge: -0.153629 -0.257891 -0.053932 0.122015 0.258419 0.230496 0.195999 0.178663 -0.328689 -0.141742 -0.089397 -0.090694 0.096299 -0.142190 0.012468 0.122540 -0.000601 0.003163 0.069577 -0.030874
polarizability: 2.39052674e+02 -5.86562335e+00 2.64244912e+02 1.89912400e+01 -3.65686699e+00 1.04518763e+02
1716.lowfreq: -0.0003 0.0004 0.0006 2.8231 3.4428 7.4046 31.9362 44.6191 54.2581
frequency: 31.6793 44.6099 54.2276 64.4861 98.7910 111.7204 144.1597 148.8297 158.6813 221.4598 232.3920 254.1915 266.8589 279.3647 302.0287 329.8533 374.4453 408.7373 425.5144 441.9884 469.6295 505.6786 543.6160 557.9907 575.9593 596.1162 625.1222 661.7779 680.4890 718.2957 735.7552 754.2367 760.4338 766.1035 787.1480 802.4633 834.8278 860.8054 871.4870 902.5277 909.4750 944.6713 952.9867 974.5765 981.4354 992.9176 997.2488 1001.2089 1027.5180 1072.5046 1079.3917 1088.5109 1103.1641 1131.0843 1155.4841 1167.4653 1171.9226 1193.5280 1211.2333 1242.1450 1248.0259 1261.8981 1282.7356 1294.1295 1341.3391 1357.1801 1367.7223 1393.4598 1393.8007 1426.9909 1451.0033 1456.6475 1464.6245 1468.2248 1470.6001 1480.5834 1483.3726 1497.1653 1574.9855 1594.7068 1596.9365 1605.3450 1614.3464 1634.4304 2974.0729 2974.9935 2986.1949 3036.0047 3069.2397 3072.8726 3076.4059 3133.9248 3142.5633 3147.9316 3155.1671 3164.0185 3170.8380 3176.0225 3543.9525
redmass: 3.6448 5.1539 4.7240 4.5649 2.8332 3.5943 3.8307 3.6921 4.5049 4.6643 1.4211 4.2898 4.6514 6.0017 4.5957 3.1975 3.2618 4.4453 3.9288 4.0915 2.5221 5.5710 6.4783 3.5184 4.7581 1.2786 6.2414 6.4195 4.9942 3.7725 4.0840 1.4341 1.5911 6.1360 1.8591 2.5103 3.7368 2.6963 1.8230 2.7691 1.4736 3.1551 1.4810 1.5084 2.2002 5.6660 1.4026 1.3575 2.1331 1.9290 2.5757 2.0232 2.0155 1.9296 2.4128 1.8435 1.1818 1.7518 2.2779 1.3962 1.9593 1.6127 1.5723 1.5632 1.4386 1.3797 6.6125 2.4594 1.2255 2.9077 2.7786 2.7297 1.1273 1.1366 2.9650 1.0861 1.5243 1.2209 7.3544 6.8752 7.4139 7.6972 7.3802 10.7797 1.0583 1.0449 1.0607 1.0998 1.0993 1.0972 1.0987 1.0862 1.0868 1.0911 1.0924 1.0967 1.0995 1.0968 1.0775
irintensity: 0.0479 4.9423 4.3417 3.4017 2.2378 1.3276 1.0187 0.8224 2.1549 0.5088 2.7399 2.6484 6.8420 0.3281 3.5510 1.3645 8.0739 2.2009 0.0245 5.3622 1.3231 1.6376 1.4091 2.6171 3.9136 99.8019 5.1581 3.3979 6.2319 1.3438 5.1573 129.3688 11.9911 3.0841 1.6650 5.6086 5.1406 16.9104 6.7461 19.0963 3.1613 13.0781 1.8791 5.4393 10.6772 3.5438 1.1713 0.5727 0.0559 7.3378 4.5759 17.1002 0.8326 10.1177 31.0223 8.0316 2.2532 10.3267 17.4219 13.2436 32.5158 10.3634 107.4788 29.9414 1.0192 2.6246 6.4068 12.7150 22.0387 18.9675 3.0715 50.2848 12.1508 27.0462 2.8530 4.0389 99.1115 89.9429 37.4945 95.0484 129.8033 33.3262 81.1101 113.4689 34.2323 34.9134 30.1045 18.5399 84.9911 15.3412 37.1821 2.8176 1.4459 5.8638 1.3818 20.0194 18.0678 11.6255 14.3001
temp: 298.150 k
press: 1.00000 atm
elementType: 8 8 7 6 6 6 6 6 6 6 6 6 6 6 6 6 6 6 6 6 1 1 1 1 1 1 1 1 1 1 1 1 1 1 1
symmnumber: 1
zpe: 726058.0 jmol-1
zpe.correction: 0.276541 hartree
zpe.thermalcorrener: 0.293747 hartree
zpe.thermalcorrenthalpy: 0.294691 hartree
zpe.thermalcorrgfe: 0.230693 hartree
zpe.sumelectzpe: -860.638663 hartree
zpe.sumelectthermal: -860.621457 hartree
zpe.sumelectthermalent: -860.620512 hartree
zpe.sumelectthermalfe: -860.684511 hartree
dipole: -3.2792 2.1374 2.0405
dipole: 4.4142
quadrupole: -122.1601 -104.6474 -122.3591
quadrupole: -11.7465 -7.8011 -8.6334
quadrupole: -5.7713 11.7415 -5.9702 -11.7465 -7.8011 -8.6334
hfenergy: -860.9152036 hartree
pointgroup: C01 [X(C17H15N1O2)]
dipole: 1.169947 -0.9442452 0.8692611 debye
polarizability: 237.8802904|-3.6746661|265.3998085|-18.4136245|-5.2711023|104.5362495 unknown
InChI: InChI=1S/C17H15NO2/c1-2-10-18-17(20)14-9-5-8-13-15(14)11-6-3-4-7-12(11)16(13)19/h3-9,18H,2,10H2,1H3
charge 0 multiplicity 1
35 atoms
O  -4.069953 0.061747 0.686316
O  2.544916 2.038579 -1.400268
N  2.47569 0.573478 0.414713
C  -0.606546 0.775579 -0.071727
C  -0.643912 -0.72305 -0.141457
C  -1.936864 1.229537 0.20441
C  -1.974499 -1.154282 0.155071
C  0.417681 1.733649 -0.261636
C  -2.842002 0.045936 0.393882
C  -2.277736 2.586782 0.25978
C  0.327091 -1.684388 -0.484017
C  0.057182 3.115506 -0.250415
C  1.886917 1.445932 -0.488656
C  -2.340797 -2.508241 0.152748
C  -1.260766 3.542878 0.009323
C  3.920388 0.275284 0.401586
C  -0.039652 -3.05724 -0.493829
C  -1.352922 -3.472858 -0.169857
C  4.241578 -1.230406 0.259076
C  3.741536 -2.090764 1.44091
H  -3.309437 2.883525 0.474831
H  1.344133 -1.391171 -0.755802
H  0.845986 3.847194 -0.453852
H  -3.371368 -2.7971 0.384151
H  -1.492429 4.612695 0.018627
H  4.380082 0.66365 1.333463
H  4.340001 0.845722 -0.444929
H  1.902867 0.19794 1.173317
H  0.711821 -3.807939 -0.763451
H  -1.606225 -4.538143 -0.182325
H  3.819122 -1.603925 -0.69409
H  5.341839 -1.327981 0.174711
H  2.63791 -2.084738 1.518144
H  4.053948 -3.144098 1.323977
H  4.153921 -1.72439 2.400273
