program: Gaussian 09
title: 000272047
version: EM64L-G09RevD.01
frameworkgroup: C1[X(C15H10O3)]
method: RPBEPBE
basis: SDD
operation: Freq
keyword: #pfreq=noraman
keyword: PBEPBE/SDD
title: #p freq=noraman PBEPBE/SDD
converged: YES YES NO NO
title: Mulliken charges:
elementType: O O O C C C C C C C C C C C C C C C H H H H H H H H H H
charge: -0.158168 -0.293134 -0.270497 0.193655 0.271071 0.196993 0.192525 -0.324539 0.126180 -0.426013 -0.361465 -0.425605 -0.318772 -0.228206 -0.241525 -0.225283 0.178732 -0.498157 0.287558 0.329054 0.281359 0.280870 0.241949 0.232292 0.236802 0.243854 0.243851 0.234619
chargesum: 0.00000
title: Mulliken charges with hydrogens summed into heavy atoms:
elementType: O O O C C C C C C C C C C C C C C C
charge: -0.158168 -0.293134 -0.270497 0.193655 0.271071 0.196993 0.192525 -0.324539 0.126180 -0.138455 -0.032410 -0.144245 -0.037902 0.013743 -0.009233 0.011519 0.178732 0.224167
polarizability: 2.47955522e+02 -1.81003868e+01 2.24938336e+02 1.30292298e-01 5.80122294e-02 6.85782050e+01
1716.lowfreq: -6.7036 -2.7270 -0.0005 0.0005 0.0007 6.7259 21.3058 54.2930 99.6705
frequency: 21.2887 54.2762 99.6691 114.3467 131.0839 136.2544 153.7668 203.2535 218.0432 274.5714 280.3281 285.2513 338.6703 371.9631 415.3818 444.6412 469.7818 480.7379 531.9296 564.0716 571.8832 626.2353 663.5949 668.4670 722.8731 729.1348 759.6641 764.0939 794.3174 804.2479 810.6723 865.7849 905.2245 923.3908 968.8892 970.5224 987.0771 992.8035 1006.8727 1019.0751 1028.1122 1064.3059 1087.3589 1105.6258 1113.1697 1145.9489 1167.8351 1174.1045 1190.5935 1206.1822 1241.0172 1255.6765 1295.0202 1371.6370 1391.2429 1421.7159 1429.3410 1450.7647 1451.1945 1457.8009 1463.1923 1468.4046 1569.2585 1589.3673 1605.7669 1614.6077 1621.1406 1635.3555 3004.6547 3106.8064 3133.8986 3145.0331 3147.7488 3148.8409 3162.5006 3165.1399 3188.8069 3198.0764
redmass: 5.8831 5.7585 1.1942 3.5395 3.5276 4.2314 6.8925 4.3233 5.5129 8.0703 8.9751 4.9829 4.5210 6.7116 3.6705 4.0732 8.1322 4.8084 6.9876 3.1819 7.1598 7.2198 6.8551 5.7725 6.0432 5.0710 1.4274 6.4729 1.6985 6.9439 3.1528 2.8135 7.6150 1.4419 1.4294 7.6141 1.4254 7.0220 1.3850 1.3424 2.1184 2.7153 1.8435 3.5000 1.2630 1.4746 1.2765 1.5025 2.1055 2.0929 2.1889 4.0370 1.5420 9.3337 2.4005 1.2978 2.3563 1.0500 2.6845 2.8662 1.0595 4.0377 7.4345 7.2673 7.7441 7.2700 9.9197 10.4054 1.0295 1.1045 1.0864 1.0880 1.0918 1.1048 1.0953 1.0991 1.0952 1.0945
irintensity: 0.9248 2.4286 2.0972 2.4303 4.3724 0.3304 1.5293 1.0376 2.2682 12.6216 2.6150 0.2908 16.1865 0.9286 1.1583 5.5327 3.7275 0.9600 1.1013 0.0367 0.6474 0.7349 4.1017 12.9768 2.1727 5.0545 133.9724 2.6438 0.0718 25.7582 0.1632 20.4207 5.9589 0.1768 0.2416 28.3374 4.6714 3.5024 2.1365 2.0496 9.7410 137.0287 17.9199 180.3822 0.0407 81.7431 6.5149 8.7312 44.9092 23.8149 188.7061 37.3684 8.3638 3.6699 22.8961 28.4730 52.9226 14.8099 0.9628 36.8587 18.9679 12.4526 127.8988 16.6809 63.8612 15.7828 108.1652 147.3700 40.0731 25.0809 3.7140 1.7076 8.8286 16.8628 15.1817 23.5996 5.4811 26.4998
temp: 298.150 k
press: 1.00000 atm
elementType: 8 8 8 6 6 6 6 6 6 6 6 6 6 6 6 6 6 6 1 1 1 1 1 1 1 1 1 1
symmnumber: 1
zpe: 545266.1 jmol-1
zpe.correction: 0.207681 hartree
zpe.thermalcorrener: 0.222162 hartree
zpe.thermalcorrenthalpy: 0.223106 hartree
zpe.thermalcorrgfe: 0.165128 hartree
zpe.sumelectzpe: -802.054070 hartree
zpe.sumelectthermal: -802.039589 hartree
zpe.sumelectthermalent: -802.038645 hartree
zpe.sumelectthermalfe: -802.096623 hartree
dipole: -3.5866 -1.4622 -0.0065
dipole: 3.8733
quadrupole: -89.1701 -95.5787 -105.9130
quadrupole: -10.8016 -0.0335 -0.0351
quadrupole: 7.7171 1.3086 -9.0257 -10.8016 -0.0335 -0.0351
hfenergy: -802.2617511 hartree
pointgroup: C01 [X(C15H10O3)]
dipole: 1.3848703 -0.6241128 -0.1214765 debye
polarizability: 246.8192815|16.2599457|223.3000635|-20.6358354|-9.5687343|71.3527183 unknown
InChI: InChI=1S/C15H10O3/c1-18-15(17)12-8-4-7-11-13(12)9-5-2-3-6-10(9)14(11)16/h2-8H,1H3
charge 0 multiplicity 1
28 atoms
O  -3.001267 2.25309 0.142524
O  3.680178 -0.568964 -0.462606
O  1.952815 -2.082224 -0.188309
C  0.051742 0.318736 -0.095334
C  -0.993397 -0.752876 0.074517
C  -0.631104 1.580732 -0.083016
C  -2.273404 -0.116672 0.18243
C  -2.106338 1.363413 0.089263
C  1.470036 0.337495 -0.253708
C  0.013366 2.815113 -0.21446
C  -0.932203 -2.160513 0.14187
C  -3.464701 -0.836831 0.350941
C  2.123479 1.606629 -0.387107
C  1.421264 2.823965 -0.369013
C  -2.137826 -2.893518 0.31284
C  -3.393089 -2.250449 0.416815
C  2.325215 -0.886743 -0.290636
C  4.60101 -1.727339 -0.51221
H  -0.576057 3.737806 -0.195271
H  0.026553 -2.673343 0.063657
H  -4.417978 -0.303547 0.428411
H  3.20921 1.605325 -0.506175
H  1.964891 3.767954 -0.474424
H  -2.08715 -3.987016 0.364681
H  -4.304221 -2.843899 0.547873
H  4.338668 -2.388653 -1.35496
H  4.544989 -2.301428 0.427833
H  5.597718 -1.285243 -0.649225
