program: Gaussian 09
title: 000272028
version: EM64L-G09RevD.01
frameworkgroup: C1[X(C3H2ClN3O4S)]
method: RPBEPBE
basis: SDD
operation: Freq
keyword: #p
keyword: freq=noraman
keyword: PBEPBE/SDD
title: #p freq=noraman PBEPBE/SDD
converged: NO YES NO NO
title: Mulliken charges:
elementType: Cl S O O O O N N N C C C H H
charge: -0.220234 0.931067 -0.398654 -0.398710 -0.193886 -0.138948 -0.311170 0.003380 0.079598 -0.050283 0.195438 -0.143761 0.356758 0.289404
chargesum: 0.00000
title: Mulliken charges with hydrogens summed into heavy atoms:
elementType: Cl S O O O O N N N C C C
charge: -0.220234 0.931067 -0.398654 -0.398710 -0.193886 -0.138948 0.045588 0.003380 0.079598 -0.050283 0.195438 0.145643
polarizability: 1.55843742e+02 1.95628159e+00 1.21587230e+02 7.26989612e-03 -4.85026643e-03 6.02320231e+01
1716.lowfreq: -5.9835 -3.4556 -0.0018 -0.0006 -0.0005 7.7927 38.1576 71.1729 106.5559
frequency: 38.1030 71.1680 106.5558 123.5409 152.3618 169.6520 195.7656 205.5373 247.7678 263.9167 310.3442 376.6635 407.5577 442.3471 547.2515 594.9197 631.1384 720.6469 740.0421 799.8512 826.2402 834.1913 894.7055 968.4315 979.4278 1114.8010 1173.2134 1189.6788 1285.7576 1303.4321 1354.8465 1391.2962 1436.3846 1468.3567 3259.6152 3403.7844
redmass: 13.4251 14.9322 15.4151 11.3696 18.1474 17.1409 7.3510 18.1722 16.3750 8.1206 10.0369 19.3281 20.3374 12.2545 10.5336 9.8970 3.9242 13.0167 14.3771 1.1730 18.1137 1.3521 8.7830 5.1397 20.5604 2.0711 2.5777 4.0625 8.0869 5.1764 2.8913 12.0932 3.0999 6.0331 1.1005 1.0850
irintensity: 2.4478 0.0947 3.0651 2.5048 3.9778 2.4733 1.0527 3.3369 13.6778 13.8026 4.3034 73.8737 87.8568 3.3117 31.5404 10.1545 10.9445 0.0253 46.7661 112.5379 51.2922 0.4710 17.7619 6.1488 54.9985 13.9378 60.0852 77.2048 34.9306 49.6961 32.7433 135.0756 74.3412 12.8284 2.4604 137.5634
temp: 298.150 k
press: 1.00000 atm
elementType: 17 16 8 8 8 8 7 7 7 6 6 6 1 1
symmnumber: 1
zpe: 179615.1 jmol-1
zpe.correction: 0.068412 hartree
zpe.thermalcorrener: 0.080113 hartree
zpe.thermalcorrenthalpy: 0.081057 hartree
zpe.thermalcorrgfe: 0.029100 hartree
zpe.sumelectzpe: -1437.617095 hartree
zpe.sumelectthermal: -1437.605393 hartree
zpe.sumelectthermalent: -1437.604449 hartree
zpe.sumelectthermalfe: -1437.656406 hartree
dipole: 1.4777 6.2921 0.0047
dipole: 6.4633
quadrupole: -102.3865 -76.4413 -85.9608
quadrupole: 1.5199 -0.0051 0.0228
quadrupole: -14.1236 11.8216 2.3021 1.5199 -0.0051 0.0228
hfenergy: -1437.6855064 hartree
pointgroup: C01 [X(C3H2Cl1N3O4S1)]
dipole: -0.2218773 -2.5329209 -0.0356651 debye
dipolederiv: -0.6074005 -0.1114347 -0.0048119 -0.3423286 -0.5402922 -0.0073125 -0.0084777 -0.0052334 -0.2496537 1.9580875 0.1807985 0.0099953 0.052722 1.4480932 0.0054605 0.0087558 0.0066914 1.1213112 -0.5152531 -0.0128671 0.027028 0.0956353 -0.4440003 -0.007279 -0.010176 0.0871893 -0.4167267 -0.5152649 -0.010399 -0.0290281 0.0956148 -0.4416856 0.0082785 0.0115128 -0.0882688 -0.4196438 -0.6626484 -0.0017246 -0.0033046 0.0421506 -0.5625149 -0.0055838 -0.0021927 -0.0061696 -0.1724593 -0.8086352 -0.0465424 -0.0042088 -0.1548486 -0.3577065 -0.003754 -0.0065983 -0.003046 -0.1777968 -0.4373023 -0.0372539 -0.0028718 -0.5789083 -0.3219005 -0.0075181 -0.0100129 -0.0025916 -0.1211264 -0.6062432 0.0991738 -0.0022994 0.4490532 -0.3818498 0.000936 0.003038 -0.0016861 -0.1735841 1.4170379 0.2081961 0.0102269 0.341288 1.1041601 0.0161945 0.0120803 0.0147853 0.1912916 0.125025 0.1927462 0.0050169 0.325183 0.0146181 0.0053384 0.0058235 0.0045076 -0.1948894 0.2029831 -0.3470807 -0.0035873 -0.1643658 -0.1958909 -0.0058338 -0.0014688 -0.0072217 0.1258711 -0.0379723 0.0141256 -0.0004459 -0.1580346 0.2951018 0.002717 -0.0022025 0.0042264 -0.0182572 0.3740212 -0.1104027 -0.0008796 0.0141332 0.3131797 0.0000825 0.0007285 -0.0012374 0.3123229 0.1135651 -0.017335 -0.0008299 -0.0172943 0.0706878 -0.0017261 -0.0008102 -0.0019454 0.1933405 unknown
polarizability: 154.5859119|6.7069574|122.8248484|0.8545829|0.9409463|60.252235 unknown
InChI: InChI=1S/C3H2N3O4S.Cl/c7-6(8)2-3(11(9)10)5-1-4-2;/h1,5H;
charge 0 multiplicity 1
14 atoms
Cl -3.414589 -1.113234 -0.038995
S  -1.691874 0.685491 0.003868
O  -1.815029 1.460167 -1.400645
O  -1.838995 1.416957 1.42908
O  0.959814 2.029952 0.046003
O  3.05515 1.089003 0.044379
N  -0.424304 -1.873229 -0.020833
N  1.806628 -1.491675 0.000331
N  1.779747 1.020187 0.034645
C  -0.250891 -0.497231 -0.001488
C  1.133437 -0.28632 0.012028
C  0.841449 -2.439109 -0.018476
H  -1.351848 -2.324449 -0.034458
H  1.018104 -3.511009 -0.031238
