program: Gaussian 09
title: 000272049
version: EM64L-G09RevD.01
frameworkgroup: C1[X(C18H16O3)]
method: RPBEPBE
basis: SDD
operation: Freq
keyword: #pfreq=noraman
keyword: PBEPBE/SDD
title: #p freq=noraman PBEPBE/SDD
converged: YES YES NO NO
title: Mulliken charges:
elementType: O O O C C C C C C C C C C C C C C C C C C H H H H H H H H H H H H H H H H
charge: -0.287579 -0.158773 -0.273007 0.195394 0.266721 0.194747 0.191612 0.111260 -0.325436 -0.426631 -0.361772 -0.323240 -0.426485 -0.353601 -0.229196 0.186956 -0.292090 -0.347707 -0.242440 -0.225750 -0.687402 0.287256 0.329018 0.279944 0.281106 0.205620 0.229795 0.241377 0.227348 0.222062 0.202198 0.193941 0.231758 0.236403 0.215519 0.211799 0.219274
chargesum: 0.00000
title: Mulliken charges with hydrogens summed into heavy atoms:
elementType: O O O C C C C C C C C C C C C C C C C C C
charge: -0.287579 -0.158773 -0.273007 0.195394 0.266721 0.194747 0.191612 0.111260 -0.325436 -0.139375 -0.032754 -0.043295 -0.145379 0.081813 0.012181 0.186956 0.157320 0.048433 -0.010682 0.010653 -0.040810
polarizability: 2.80288664e+02 -1.64370579e+01 2.63857825e+02 -1.99103404e+01 -9.27238953e+00 1.03820176e+02
1716.lowfreq: -8.3306 -3.2850 -0.0010 -0.0003 0.0003 5.7739 8.6962 27.4952 46.6724
frequency: 7.1443 27.4650 46.6498 61.0287 66.2386 104.4453 115.9358 148.7034 150.5187 172.8724 200.5565 215.9269 228.6090 241.3851 275.8983 283.5134 317.6033 370.7080 399.0446 415.3260 444.6121 451.4509 469.1740 486.9858 535.0956 563.9785 576.0764 627.0503 664.3499 668.4385 719.8672 729.3042 742.9904 759.1269 763.5338 790.7263 793.7453 810.5326 818.4683 865.2708 895.0627 904.6366 923.2736 939.7135 955.9778 967.3708 986.7556 992.3542 1005.8364 1018.6624 1027.7199 1031.9424 1059.8592 1074.6571 1087.0704 1100.3313 1116.6714 1163.2797 1167.4002 1174.1450 1189.8041 1205.9874 1225.5347 1238.4925 1254.7626 1274.4384 1290.6748 1293.3801 1295.4123 1347.3740 1366.9688 1373.0979 1390.8482 1391.0415 1427.7251 1450.2826 1451.3433 1457.6568 1468.4814 1470.7595 1476.2757 1477.8039 1488.3024 1568.7242 1589.1097 1605.3705 1612.8727 1617.1228 1634.8962 2969.7331 2977.1260 2994.5047 3015.2502 3022.3303 3055.1692 3075.2391 3077.6740 3102.1274 3133.4869 3144.5962 3147.7414 3162.2036 3164.8663 3189.6121 3198.7201
redmass: 3.7449 5.4966 3.1194 2.1417 6.3933 2.7962 4.5365 3.3928 5.7076 4.1808 4.1366 5.0598 1.1892 4.8289 8.6855 5.0392 4.1991 6.4126 3.0189 3.7096 4.0451 5.0174 7.7761 5.1215 7.2565 3.1895 6.8373 7.1534 6.6061 5.8537 4.2001 5.0683 1.0954 1.4282 6.0629 2.1290 1.7097 3.1242 2.0714 2.8139 3.0174 2.7610 1.4411 1.3221 4.7141 1.4319 1.4244 7.1089 1.3864 1.3504 2.2035 3.4938 2.9588 2.4518 1.8460 3.0539 2.5907 1.7325 1.2864 1.4820 2.1601 2.1143 1.4161 1.9988 3.6098 1.2817 1.1256 1.0899 1.5331 1.4310 1.8456 3.4718 1.8507 1.4330 2.8488 1.5382 1.6768 2.6742 3.9545 1.0690 1.0524 1.0540 1.0864 7.4633 7.3077 7.7422 7.9400 8.7330 10.5112 1.0586 1.0364 1.0601 1.0998 1.0578 1.1029 1.1011 1.0996 1.1084 1.0864 1.0880 1.0918 1.0954 1.0991 1.0950 1.0944
irintensity: 0.1853 0.0520 0.2321 0.0445 5.8142 0.5045 0.7018 0.6369 0.1262 1.3957 0.2261 1.4269 0.4392 0.8930 8.2816 0.0635 19.0921 0.4142 3.4284 2.0026 6.3296 3.3671 4.0201 2.0868 1.6382 0.0816 2.0801 0.5955 3.5792 12.3537 2.0573 5.3062 9.8938 132.1789 2.4641 9.0160 0.0973 0.3111 10.6282 19.3479 20.3404 7.3120 0.2086 6.5454 57.6340 0.4783 4.5110 2.0149 1.9610 2.2046 15.6371 12.4246 234.9793 4.6752 16.8255 233.0069 3.5411 39.5030 4.7024 7.4705 49.8726 28.1894 73.0311 159.9832 37.1889 11.5751 0.1495 2.9412 7.8269 3.1685 4.3080 4.2296 16.5190 15.8795 56.1997 14.6623 4.3948 38.5933 10.7955 0.5006 7.9194 8.7438 18.8928 132.1395 18.1529 66.4706 0.8683 116.5612 139.4816 33.6337 31.4278 19.6021 9.4649 53.3234 5.0811 58.7924 53.6742 33.7985 3.7967 1.9395 9.1418 15.6479 23.7966 5.6484 28.7682
temp: 298.150 k
press: 1.00000 atm
elementType: 8 8 8 6 6 6 6 6 6 6 6 6 6 6 6 6 6 6 6 6 6 1 1 1 1 1 1 1 1 1 1 1 1 1 1 1 1
symmnumber: 1
zpe: 766136.3 jmol-1
zpe.correction: 0.291806 hartree
zpe.thermalcorrener: 0.310322 hartree
zpe.thermalcorrenthalpy: 0.311267 hartree
zpe.thermalcorrgfe: 0.242125 hartree
zpe.sumelectzpe: -919.729108 hartree
zpe.sumelectthermal: -919.710591 hartree
zpe.sumelectthermalent: -919.709647 hartree
zpe.sumelectthermalfe: -919.778789 hartree
dipole: 4.2813 0.2626 -0.3415
dipole: 4.3030
quadrupole: -122.4147 -106.8167 -125.6559
quadrupole: -10.0026 0.8851 0.5651
quadrupole: -4.1190 11.4791 -7.3601 -10.0026 0.8851 0.5651
hfenergy: -920.0209136 hartree
pointgroup: C01 [X(C18H16O3)]
dipole: 1.6891674 0.0794091 0.0797536 debye
polarizability: 277.7610869|19.0385937|264.3417022|14.1006485|-23.5473766|105.8638773 unknown
InChI: InChI=1S/C18H16O3/c1-2-3-11-21-18(20)15-10-6-9-14-16(15)12-7-4-5-8-13(12)17(14)19/h4-10H,2-3,11H2,1H3
charge 0 multiplicity 1
37 atoms
O  2.523577 1.349955 0.373263
O  -4.631877 0.480076 -0.613834
O  1.687195 -0.778506 0.756152
C  -1.070371 0.331731 0.029886
C  -1.487197 -1.105996 0.201903
C  -2.251568 1.076853 -0.299984
C  -2.898625 -1.194403 -0.032026
C  0.161307 1.047896 0.111604
C  -3.438413 0.159552 -0.352377
C  -2.260539 2.455305 -0.537592
C  -0.782603 -2.283862 0.527166
C  0.144043 2.459754 -0.136769
C  -3.604392 -2.4036 0.045936
C  4.53802 0.222217 -0.585499
C  -1.034198 3.158359 -0.452014
C  1.478613 0.420763 0.441345
C  3.893571 0.830988 0.667243
C  5.991102 -0.233546 -0.310636
C  -1.494408 -3.511464 0.605273
C  -2.887054 -3.582021 0.369255
C  6.654318 -0.854641 -1.559065
H  -3.203061 2.955929 -0.78289
H  0.289724 -2.246143 0.71933
H  1.093995 2.994846 -0.072649
H  -4.683223 -2.418554 -0.141265
H  4.529488 0.970471 -1.40169
H  3.935381 -0.642365 -0.921079
H  -0.99642 4.237554 -0.630194
H  3.822642 0.085428 1.479671
H  4.439483 1.724132 1.014201
H  5.995192 -0.973105 0.515468
H  6.592485 0.631104 0.037021
H  -0.944189 -4.425059 0.857595
H  -3.406999 -4.543536 0.438057
H  6.090455 -1.740437 -1.905911
H  6.687809 -0.129385 -2.393508
H  7.690539 -1.174489 -1.346386
