program: Gaussian 09
title: 000272022
version: EM64L-G09RevD.01
frameworkgroup: C1[X(C10H12N2O4)]
method: RPBEPBE
basis: SDD
operation: Freq
keyword: #p
keyword: freq=noraman
keyword: PBEPBE/SDD
title: #p freq=noraman PBEPBE/SDD
converged: YES YES NO NO
title: Mulliken charges:
elementType: O O O O N N C C C C C C C C C C H H H H H H H H H H H H
charge: -0.249718 -0.478380 -0.415652 -0.252108 -0.566779 -0.668694 -0.543571 -0.210828 0.129110 0.347481 -0.521205 -0.351845 0.201425 0.159048 0.332266 -0.392662 0.244858 0.262404 0.275777 0.271018 0.242908 0.272272 0.289510 0.223805 0.348039 0.310004 0.370581 0.370936
chargesum: 0.00000
title: Mulliken charges with hydrogens summed into heavy atoms:
elementType: O O O O N N C C C C C C C C C C
charge: -0.249718 -0.107800 -0.044716 -0.252108 -0.004997 -0.010651 -0.036308 0.064949 0.129110 0.347481 -0.250187 -0.108937 0.201425 0.159048 0.332266 -0.168857
polarizability: 2.25395777e+02 1.01691889e+01 1.38485857e+02 1.55971430e+01 6.46690577e+00 8.09965279e+01
1716.lowfreq: -8.1339 -0.0007 -0.0005 -0.0004 1.3918 7.4865 25.9452 33.3975 54.9410
frequency: 25.7787 33.2926 54.9334 80.1081 96.7340 106.9014 174.0172 206.5591 224.0025 251.7894 270.3571 302.3135 306.7782 307.0167 342.1988 349.9839 385.8460 405.0661 449.7341 479.0850 511.2007 530.7185 532.1844 549.7728 575.2815 599.3587 617.4958 639.9475 652.1733 704.3760 739.0797 746.2768 782.9964 794.1074 811.8744 887.9702 897.4075 933.6956 965.6956 997.0917 1026.3850 1035.8515 1056.7568 1099.5339 1103.0779 1139.0772 1167.1244 1178.6924 1216.9450 1248.0042 1277.8706 1301.3803 1319.7917 1351.2230 1354.6963 1367.2688 1400.9229 1426.4282 1466.4324 1535.8019 1551.5245 1589.3686 1613.6871 1638.6277 1641.9124 1653.1815 2987.0024 3050.3107 3081.8727 3125.0056 3129.3719 3159.9361 3444.3223 3507.8963 3553.8529 3575.3035 3609.6608 3702.0949
redmass: 6.8280 5.7764 7.4857 7.7342 5.0135 5.6514 3.6413 5.1436 4.4177 3.5233 4.4823 1.7724 2.4593 2.6889 3.0492 1.2294 6.0352 1.3275 2.4319 3.8190 2.8709 1.3524 2.4091 5.4022 2.2277 1.7561 3.9541 3.4671 1.5392 5.1488 3.7826 4.7555 3.7570 3.9354 1.6628 4.4949 1.4614 1.4004 2.0365 3.1332 1.6055 2.4689 2.0212 1.8642 2.4419 1.2908 1.1945 1.6906 1.5002 1.5637 2.0241 1.4977 1.9468 2.6017 1.5438 1.8572 4.6361 1.1129 5.8680 3.9271 7.1231 6.8185 1.4922 1.1037 3.3134 7.6066 1.0613 1.0965 1.0872 1.0915 1.0883 1.0951 1.0447 1.0639 1.0447 1.0978 1.0663 1.1045
irintensity: 2.9614 0.8117 2.7261 0.8474 1.3633 0.0449 1.1541 0.2277 9.1038 8.5908 0.2091 49.7678 17.2487 63.0112 4.0136 99.7696 0.2502 183.4147 16.2196 30.9050 2.0541 114.1770 58.6290 0.5479 95.5861 104.4160 13.0844 20.0425 199.5116 28.9773 3.8234 12.3971 4.2920 12.6267 43.9768 36.3764 30.4196 0.1563 7.2427 21.2304 7.7939 185.4497 195.1411 166.5342 80.8183 11.8683 64.1363 104.6301 14.0906 14.0817 65.5003 26.8897 19.7043 215.4479 7.4845 51.1540 71.7512 34.8136 103.7376 164.5788 201.1018 54.7989 13.9357 49.0807 359.5213 186.5654 15.4020 4.0604 9.5106 9.5380 18.2134 10.1530 2.3479 20.4532 161.3722 2.9364 46.1216 40.3750
temp: 298.150 k
press: 1.00000 atm
elementType: 8 8 8 8 7 7 6 6 6 6 6 6 6 6 6 6 1 1 1 1 1 1 1 1 1 1 1 1
symmnumber: 1
zpe: 562301.1 jmol-1
zpe.correction: 0.214169 hartree
zpe.thermalcorrener: 0.230226 hartree
zpe.thermalcorrenthalpy: 0.231170 hartree
zpe.thermalcorrgfe: 0.169747 hartree
zpe.sumelectzpe: -797.486510 hartree
zpe.sumelectthermal: -797.470454 hartree
zpe.sumelectthermalent: -797.469510 hartree
zpe.sumelectthermalfe: -797.530933 hartree
dipole: 3.0759 1.7153 0.1934
dipole: 3.5272
quadrupole: -61.9026 -81.3572 -102.0640
quadrupole: 0.6934 0.8619 2.4625
quadrupole: 19.8720 0.4174 -20.2894 0.6934 0.8619 2.4625
hfenergy: -797.7006795 hartree
pointgroup: C01 [X(C10H12N2O4)]
dipole: -1.206204 0.676069 -0.1171092 debye
polarizability: 226.0182175|-9.7527461|136.5137571|12.3907687|-12.6610673|82.3461874 unknown
InChI: InChI=1S/C10H12N2O4/c11-6-2-1-5(3-9(6)14)8(13)4-7(12)10(15)16/h1-3,7,14-15H,4,11-12H2
charge 0 multiplicity 1
28 atoms
O  1.103322 -1.338075 0.685573
O  -4.040082 -1.752027 0.403885
O  4.53945 -1.450576 -0.062308
O  3.243161 -0.710405 -1.843837
N  4.056862 1.65661 0.238155
N  -4.934437 0.649275 -0.35539
C  1.702389 0.930904 0.048941
C  3.14601 0.492803 0.337399
C  0.691845 -0.190274 0.313558
C  -0.753161 0.087338 0.128466
C  -1.680034 -0.972518 0.362764
C  -1.25827 1.353808 -0.274354
C  3.579262 -0.609378 -0.641285
C  -3.04837 -0.765204 0.197718
C  -3.566554 0.509134 -0.208589
C  -2.639139 1.562223 -0.440031
H  1.614369 1.253088 -1.008394
H  1.480997 1.811081 0.680646
H  3.214079 0.079076 1.355734
H  -1.272762 -1.944276 0.670864
H  -0.572268 2.185745 -0.462551
H  4.074089 2.085899 -0.694256
H  4.999948 1.471158 0.59536
H  -3.01531 2.543464 -0.751991
H  -5.532287 -0.15356 -0.172219
H  -5.34684 1.530913 -0.644562
H  -3.63463 -2.611158 0.673959
H  4.83186 -2.124165 -0.734857
