program: Gaussian 09
title: 000272063
version: EM64L-G09RevD.01
frameworkgroup: C1[X(C18H16O4)]
method: RPBEPBE
basis: SDD
operation: Freq
keyword: #pfreq=noraman
keyword: PBEPBE/SDD
title: #p freq=noraman PBEPBE/SDD
converged: YES YES NO NO
title: Mulliken charges:
elementType: O O O O C C C C C C C C C C C C C C C C C C H H H H H H H H H H H H H H H H
charge: -0.250091 -0.250922 -0.253496 -0.268264 -0.421566 0.005398 0.335320 0.304087 0.136237 0.457453 -0.432992 -0.436361 -0.345504 -0.417482 -0.505281 -0.247705 -0.234233 -0.275985 0.316499 -0.758429 0.309020 -0.751613 0.274171 0.279505 0.253538 0.265918 0.231894 0.252681 0.235243 0.232329 0.229252 0.234711 0.250340 0.252330 0.245711 0.254764 0.249200 0.244322
chargesum: 0.00000
title: Mulliken charges with hydrogens summed into heavy atoms:
elementType: O O O O C C C C C C C C C C C C C C C C C C
charge: -0.250091 -0.250922 -0.253496 -0.268264 -0.147395 0.005398 0.335320 0.304087 0.136237 0.457453 -0.153487 -0.182823 -0.079586 -0.185588 -0.017357 -0.015375 -0.004981 -0.041274 0.316499 -0.010048 0.309020 -0.003327
polarizability: 2.57388305e+02 -1.46682999e+01 2.54414829e+02 1.51731580e+01 -1.62273604e+00 1.24070721e+02
1716.lowfreq: -5.5926 -0.0008 -0.0002 0.0002 4.2237 5.5048 25.3947 26.9773 34.2411
frequency: 25.3758 26.9189 34.2323 41.7126 51.1336 54.1375 69.9714 84.7481 100.3253 118.6009 145.6548 176.7492 204.1651 207.9745 243.2734 252.8561 283.8284 322.7017 340.6723 399.8968 411.2543 427.8429 444.3044 511.6369 521.0113 536.0303 558.2128 563.0565 568.3217 582.8264 589.8056 613.5559 642.1603 654.9766 707.1840 733.3252 756.0046 782.4189 787.7504 812.0761 827.9618 840.3987 866.6985 896.4559 902.3494 927.6620 936.1647 958.1259 966.4662 987.5633 992.5440 992.7588 994.5880 996.7716 1018.1544 1035.1875 1042.3416 1043.4521 1086.5766 1106.4198 1167.7201 1176.3955 1179.7361 1192.1077 1196.4462 1204.7164 1217.3189 1235.5172 1251.9844 1275.5519 1295.5330 1309.4175 1350.2700 1376.7131 1383.4702 1383.8803 1399.8821 1437.8667 1452.0832 1452.4860 1453.7123 1454.4896 1456.1583 1466.8871 1483.1758 1497.3894 1592.1501 1601.2572 1612.2323 1621.4705 1639.5794 1640.4826 3007.0789 3007.3273 3012.6685 3024.3350 3087.6880 3097.5420 3098.3328 3122.3921 3130.1120 3142.4011 3143.0775 3143.4936 3146.5232 3160.3576 3166.0662 3178.3192
redmass: 3.5451 2.3238 1.1301 1.9564 3.4734 9.8802 2.8910 4.7955 4.4515 3.9041 5.6375 7.4451 6.0343 5.3425 4.2067 4.9969 3.4749 4.5561 2.8899 3.5052 5.4659 4.1636 3.2891 4.3306 3.8523 4.7086 3.4848 3.1815 3.3425 4.9886 5.2118 5.3206 5.8323 5.6241 5.1888 4.1094 1.4890 3.1765 1.6172 4.3530 3.8053 4.9528 2.3348 1.9343 5.1357 5.8632 1.5117 1.5216 2.1042 1.3923 2.3694 1.8484 1.3912 3.5285 3.1622 2.2185 1.6520 1.6579 1.8570 1.8659 1.3156 1.1326 1.2333 1.8159 3.5087 1.6333 1.9759 2.0768 3.4090 1.8709 1.4225 1.5367 1.4294 7.6891 1.2414 1.2553 3.1662 2.5740 1.0625 1.0592 1.0542 1.0526 2.7177 3.2879 2.9809 1.1761 6.4102 7.8778 7.0230 7.2538 9.2459 9.0393 1.0375 1.0376 1.0833 1.0579 1.1066 1.0960 1.0957 1.0884 1.0857 1.0914 1.1017 1.1015 1.0910 1.0972 1.0987 1.0959
irintensity: 0.6570 2.1156 1.2341 0.0675 0.3891 3.7295 1.2473 0.5211 3.4483 2.8612 2.5855 0.0876 15.9075 5.3011 0.4740 3.3144 3.8822 0.5465 1.6265 0.5872 3.7944 5.2085 1.8368 4.3953 11.0177 0.0189 1.1560 0.0693 1.5734 2.3474 18.9436 5.5210 0.3781 3.7867 2.9259 5.4764 90.7183 56.2192 5.9358 16.1198 13.5102 14.0829 0.6544 2.9614 121.7034 36.6404 0.5939 4.8306 52.2191 2.0266 60.9912 80.6306 1.1965 12.5076 35.6795 3.2933 7.4549 8.9236 5.3396 4.1389 5.8596 2.4968 1.9693 145.3064 468.6972 89.4835 5.5768 2.3485 2.4902 2.6715 9.9833 0.6259 5.1551 7.9435 76.9408 31.0672 4.9527 29.5963 18.4846 26.9476 22.4714 22.3807 10.8787 6.4538 1.5569 18.6880 2.1142 2.0741 1.8467 3.6819 30.4509 326.0253 1.8299 2.2467 11.7341 24.5752 14.5878 8.4014 6.9050 11.6074 0.0941 15.5105 9.0257 9.9436 9.9546 27.4345 16.1813 6.9290
temp: 298.150 k
press: 1.00000 atm
elementType: 8 8 8 8 6 6 6 6 6 6 6 6 6 6 6 6 6 6 6 6 6 6 1 1 1 1 1 1 1 1 1 1 1 1 1 1 1 1
symmnumber: 1
zpe: 771191.3 jmol-1
zpe.correction: 0.293731 hartree
zpe.thermalcorrener: 0.314023 hartree
zpe.thermalcorrenthalpy: 0.314967 hartree
zpe.thermalcorrgfe: 0.241542 hartree
zpe.sumelectzpe: -994.879986 hartree
zpe.sumelectthermal: -994.859695 hartree
zpe.sumelectthermalent: -994.858751 hartree
zpe.sumelectthermalfe: -994.932176 hartree
dipole: 0.3919 -0.1105 -0.0665
dipole: 0.4126
quadrupole: -120.7235 -113.0785 -131.9133
quadrupole: 7.6241 -15.0761 6.4286
quadrupole: 1.1816 8.8266 -10.0082 7.6241 -15.0761 6.4286
hfenergy: -995.1737177 hartree
pointgroup: C01 [X(C18H16O4)]
dipole: -0.1428332 -0.0689515 0.0346119 debye
polarizability: 250.813488|16.5427999|258.4041278|14.7757004|-16.7234804|126.6562396 unknown
InChI: InChI=1S/C18H16O4/c1-11(19)21-10-13-6-5-9-16-17(13)14-7-3-4-8-15(14)18(16)22-12(2)20/h3-9,18H,10H2,1-2H3
charge 0 multiplicity 1
38 atoms
O  -3.053203 -0.279426 0.425301
O  3.617136 -0.521289 -0.041124
O  -4.069353 -1.917541 -0.895173
O  4.52705 1.408285 0.914608
C  -1.832538 -0.334903 -0.458804
C  0.415286 -0.665787 0.375121
C  -0.800044 -1.336337 0.036953
C  -1.104814 0.991093 -0.358083
C  0.224949 0.789771 0.12429
C  1.521003 -1.418862 0.851577
C  -0.941024 -2.727283 0.153171
C  -1.589721 2.268823 -0.670289
C  1.080525 1.904161 0.2820
C  1.362632 -2.824849 0.980866
C  2.847446 -0.806587 1.224331
C  0.157531 -3.477124 0.640512
C  -0.729885 3.383449 -0.50204
C  0.591091 3.195738 -0.03115
C  -4.10972 -1.129567 0.078589
C  -5.256443 -0.962896 1.051096
C  4.432421 0.615894 -0.052347
C  5.131742 0.742904 -1.387313
H  -2.190222 -0.582413 -1.476815
H  -1.877745 -3.216827 -0.131326
H  -2.615464 2.405082 -1.029384
H  2.107303 1.804208 0.64179
H  2.20971 -3.417084 1.348324
H  2.766021 0.131409 1.798852
H  3.463124 -1.520305 1.798142
H  0.076771 -4.563989 0.746533
H  -1.08728 4.391799 -0.737666
H  1.250318 4.061767 0.094742
H  -5.447521 0.104221 1.249364
H  -4.993626 -1.435433 2.014795
H  -6.157825 -1.446365 0.647598
H  4.393967 1.005923 -2.166753
H  5.589455 -0.216699 -1.678414
H  5.896845 1.530439 -1.331372
