program: Gaussian 09
title: 000272027
version: EM64L-G09RevD.01
frameworkgroup: C1[X(C17H18N2O)]
method: RPBEPBE
basis: SDD
operation: Freq
keyword: #p
keyword: freq=noraman
keyword: PBEPBE/SDD
title: #p freq=noraman PBEPBE/SDD
converged: YES YES NO NO
title: Mulliken charges:
elementType: O N N C C C C C C C C C C C C C C C C C H H H H H H H H H H H H H H H H H H
charge: -0.274182 -0.153496 0.052064 -0.252247 -0.488813 0.332030 -0.576605 0.273749 -0.619361 0.542550 -0.440676 -0.413679 -0.235940 -0.231891 -0.404923 -0.417017 -0.356016 -0.364206 0.405437 -0.678604 0.243589 0.228406 0.231845 0.231055 0.225342 0.221071 0.230988 0.238769 0.238571 0.223944 0.223936 0.233154 0.239026 0.241251 0.279897 0.245676 0.246207 0.279100
chargesum: 0.00000
title: Mulliken charges with hydrogens summed into heavy atoms:
elementType: O N N C C C C C C C C C C C C C C C C C
charge: -0.274182 -0.153496 0.052064 -0.008659 -0.028562 0.332030 -0.120208 0.273749 -0.167302 0.542550 -0.201907 -0.175108 -0.011996 -0.007955 -0.171769 -0.177991 -0.114765 -0.084308 0.405437 0.092379
polarizability: 3.33302907e+02 -1.82211152e+01 1.89804773e+02 1.92754454e+01 9.04159659e+00 1.11430822e+02
1716.lowfreq: -0.0004 -0.0003 0.0005 3.3257 4.2821 15.3501 21.1462 28.1904 34.8156
frequency: 20.2013 27.8826 34.7540 38.4063 85.9017 93.1937 122.1647 173.5373 183.6810 190.9978 220.5670 245.3158 306.5738 335.5830 347.2945 356.4536 391.0611 395.7857 407.6371 428.9885 439.2054 453.9600 520.3725 533.3336 549.5031 584.7510 630.2324 635.0064 655.8583 721.1861 726.2480 756.4585 760.7687 784.7239 797.0781 815.3212 828.8438 844.7216 866.2788 866.7102 873.8893 897.4914 925.4335 944.5177 949.7371 968.0312 984.4654 985.8390 1004.5034 1021.9624 1039.9607 1050.5590 1056.0900 1081.8755 1104.3271 1111.6049 1137.5528 1158.2833 1169.2638 1170.9403 1181.6333 1193.3195 1195.0424 1214.2268 1221.2723 1251.8800 1263.2984 1293.3616 1298.5128 1302.8386 1307.3990 1318.8707 1321.2124 1354.5340 1387.4900 1389.5077 1410.2152 1423.4387 1446.3120 1459.5725 1468.2086 1471.7068 1475.9356 1476.7189 1487.5307 1504.4550 1580.3476 1595.7651 1615.7377 1620.2125 2973.1045 2982.3971 2988.6163 2992.6431 3011.0692 3042.0239 3044.8686 3073.3781 3082.5041 3101.5662 3113.6896 3120.9839 3121.2006 3126.8973 3136.3568 3157.2478 3163.4559 3191.4019
redmass: 4.7502 4.7668 4.4130 3.6190 4.9037 3.7600 5.4857 3.8471 1.6554 1.7552 3.2957 3.5478 4.1690 2.9138 3.2893 3.4275 4.0277 4.5098 2.9467 3.3664 3.1384 4.2955 3.5558 4.1015 2.8126 5.7959 4.8964 4.5096 3.4970 3.5945 2.9773 1.6255 2.1508 3.7299 2.6345 3.6063 1.6481 1.8909 1.9899 3.5823 1.4037 2.1780 1.8553 1.4408 1.4185 2.4186 1.3171 1.3752 3.0781 2.2415 2.1438 3.9826 2.1440 2.2795 1.3198 1.3747 1.1978 1.6223 1.0710 1.7206 1.4710 1.2977 1.2052 1.6606 2.3292 1.5368 1.5752 1.4320 1.6844 4.0502 1.3394 1.4140 1.4625 3.9613 6.5730 6.5035 1.3245 2.8085 2.3975 1.2415 1.1333 1.0775 1.1025 1.9919 1.0484 2.7195 7.0240 6.8456 7.0723 6.3779 1.0660 1.0603 1.0322 1.0790 1.0698 1.1006 1.0949 1.1030 1.1025 1.0996 1.0864 1.0888 1.0894 1.0905 1.0939 1.1002 1.0938 1.0938
irintensity: 4.6739 0.7386 0.3488 0.4673 0.1497 0.3076 0.0689 4.6024 0.0231 0.9854 0.4285 5.0308 1.8445 2.2675 0.8464 0.6132 3.2513 1.0188 0.2615 5.7197 7.7170 1.1331 4.9683 2.9890 20.7110 1.6065 1.4751 1.5123 0.3262 3.4884 2.7144 34.3242 32.4927 33.4797 32.1441 21.1448 7.8793 5.8260 27.8309 165.2966 1.9328 3.4403 1.0876 3.3307 1.0767 2.6098 0.0354 0.5757 13.4700 8.8891 21.7729 101.7476 15.3200 7.6136 0.0139 3.2738 4.6990 4.4444 0.4770 22.4003 1.5395 14.0899 3.1097 0.5498 1.5615 2.2363 4.0048 0.1468 2.7436 36.6502 20.0258 4.4369 21.8481 175.4788 16.7160 20.5367 30.7779 15.5940 4.8184 8.3883 12.9256 35.5625 7.7821 22.1405 22.9055 102.5614 0.6966 0.7248 1.6858 0.7814 30.5077 27.0481 21.8646 10.2504 38.4901 28.6093 22.7009 40.0739 18.3690 3.3422 8.8938 5.9529 12.8935 20.3227 33.6908 40.7226 11.3437 0.3366
temp: 298.150 k
press: 1.00000 atm
elementType: 8 7 7 6 6 6 6 6 6 6 6 6 6 6 6 6 6 6 6 6 1 1 1 1 1 1 1 1 1 1 1 1 1 1 1 1 1 1
symmnumber: 1
zpe: 812066.0 jmol-1
zpe.correction: 0.309300 hartree
zpe.thermalcorrener: 0.326918 hartree
zpe.thermalcorrenthalpy: 0.327862 hartree
zpe.thermalcorrgfe: 0.261418 hartree
zpe.sumelectzpe: -841.848861 hartree
zpe.sumelectthermal: -841.831243 hartree
zpe.sumelectthermalent: -841.830299 hartree
zpe.sumelectthermalfe: -841.896743 hartree
dipole: -2.7126 2.6829 0.8317
dipole: 3.9049
quadrupole: -138.6455 -108.8675 -120.1582
quadrupole: 19.2302 6.6724 2.5115
quadrupole: -16.0884 13.6896 2.3989 19.2302 6.6724 2.5115
hfenergy: -842.1581608 hartree
pointgroup: C01 [X(C17H18N2O1)]
dipole: 1.063327 0.9596142 -0.5556204 debye
polarizability: 334.4382496|19.269128|182.9211051|9.158511|-24.0180265|117.179148 unknown
InChI: InChI=1S/C17H18N2O/c1-19(18-20)16-10-6-13(7-11-16)12-15-9-8-14-4-2-3-5-17(14)15/h2-7,10-11,15H,8-9,12H2,1H3
charge 0 multiplicity 1
38 atoms
O  -6.760756 -0.927545 0.453782
N  -4.851456 0.220257 0.036648
N  -5.492352 -0.882229 0.633011
C  1.698662 0.134768 -0.558072
C  1.575114 -1.393788 -0.864097
C  3.202772 0.308629 -0.355908
C  2.792761 -2.063963 -0.152768
C  3.824629 -0.943375 -0.108504
C  0.911616 0.579087 0.725375
C  -0.596705 0.490498 0.567783
C  3.960136 1.497837 -0.34855
C  5.209916 -1.015236 0.142413
C  5.353761 1.427141 -0.102526
C  5.974411 0.178099 0.141807
C  -1.304847 1.441762 -0.207901
C  -1.348037 -0.554996 1.167817
C  -2.701086 1.356892 -0.386512
C  -2.741622 -0.659666 1.005337
C  -3.433005 0.301892 0.218249
C  -5.610216 1.223448 -0.729034
H  1.324881 0.742923 -1.404541
H  1.663523 -1.551028 -1.955127
H  0.604337 -1.811583 -0.545841
H  3.151908 -2.961657 -0.687503
H  2.529379 -2.388654 0.874612
H  1.207939 1.620835 0.957728
H  1.247373 -0.042664 1.577155
H  3.484869 2.467384 -0.542558
H  5.695433 -1.980459 0.329818
H  5.957154 2.342138 -0.106075
H  7.053933 0.13551 0.327001
H  -0.759529 2.270286 -0.676907
H  -0.830196 -1.298932 1.785533
H  -3.209169 2.113416 -0.991554
H  -3.29949 -1.469189 1.479747
H  -5.281397 1.244388 -1.7829
H  -5.488771 2.22635 -0.284291
H  -6.670075 0.923423 -0.681949
