program: Gaussian 09
title: 000272089
version: EM64L-G09RevD.01
frameworkgroup: C1[X(C19H23NO9)]
method: RPBEPBE
basis: SDD
operation: Freq
keyword: #p
keyword: freq=noraman
keyword: PBEPBE/SDD
title: #p freq=noraman PBEPBE/SDD
converged: NO YES NO NO
title: Mulliken charges:
elementType: O O O O O O O O O N C C C C C C C C C C C C C C C C C C C H H H H H H H H H H H H H H H H H H H H H H H
charge: -0.288561 -0.300325 -0.260607 -0.297827 -0.260266 -0.266880 -0.254308 -0.201716 -0.201754 0.027573 -0.145290 -0.105164 -0.118588 -0.116533 -0.021037 0.374777 0.371719 -0.392767 -0.685503 -0.702976 -0.690437 -0.691178 0.253388 0.252079 -0.331922 -0.306369 -0.352818 -0.347027 0.386225 0.257290 0.255108 0.245645 0.262295 0.263758 0.249764 0.247150 0.230266 0.231786 0.221412 0.216787 0.248114 0.225076 0.229260 0.221039 0.235030 0.218246 0.218599 0.255980 0.281022 0.280435 0.290793 0.289242
chargesum: 0.00000
title: Mulliken charges with hydrogens summed into heavy atoms:
elementType: O O O O O O O O O N C C C C C C C C C C C C C C C C C C C
charge: -0.288561 -0.300325 -0.260607 -0.297827 -0.260266 -0.266880 -0.254308 -0.201716 -0.201754 0.027573 0.112000 0.149943 0.127057 0.145762 0.242721 0.374777 0.371719 0.104147 -0.002039 -0.013000 -0.005109 0.001647 0.253388 0.252079 -0.050900 -0.025934 -0.062025 -0.057785 0.386225
polarizability: 3.46327440e+02 -3.84585419e+01 1.80367878e+02 3.69949038e+00 1.09998327e+01 2.13782751e+02
1716.lowfreq: -13.7921 -4.6414 -0.0004 0.0001 0.0006 1.2485 12.9682 15.8203 23.1553
frequency: 12.2000 15.6549 22.9519 39.9131 47.5899 54.1214 64.7234 70.3341 88.2013 95.4233 102.4877 140.2538 150.3952 159.5734 171.3191 189.9900 195.4662 204.9902 218.3729 227.2485 233.0758 248.9780 267.0021 284.7123 298.4021 313.9893 329.0338 336.4417 343.9336 376.5516 394.2256 395.5043 409.5417 433.4542 451.8883 457.9108 467.7157 475.9087 479.8241 494.6822 518.0527 560.5610 623.7645 627.8939 635.6312 652.0820 680.1583 684.6867 692.2907 706.6546 710.2007 727.1323 753.6939 755.7371 764.6512 781.4685 797.6211 801.9917 839.0877 849.0768 862.9636 887.9283 914.8658 922.0812 925.1808 931.4649 937.0873 942.1700 957.7208 969.9151 983.3115 984.6458 986.4797 1001.2716 1003.6226 1006.6277 1011.5401 1019.5254 1050.9162 1071.6760 1087.8381 1089.9842 1109.3064 1128.1427 1129.7902 1141.4567 1162.1935 1176.2250 1204.5747 1213.8619 1215.2902 1224.1413 1231.4355 1244.6431 1247.7047 1253.0560 1258.3788 1268.7931 1274.4060 1282.5466 1293.0372 1304.9938 1321.4012 1339.1190 1352.0135 1366.4644 1367.4049 1377.8319 1379.9047 1381.1198 1391.8426 1393.5710 1405.9553 1414.8434 1448.7068 1449.0566 1451.0816 1453.4139 1454.2080 1467.1601 1467.8966 1472.9480 1474.1547 1475.9522 1590.5687 1609.8087 1623.2794 2992.0873 2996.1745 3000.3639 3000.4234 3001.6072 3003.1482 3004.1515 3036.9304 3042.1692 3064.0150 3098.7842 3099.5412 3099.9134 3106.7783 3107.7447 3109.1569 3114.6527 3122.1708 3124.0183 3163.7300 3178.1952 3188.0224 3196.0962
redmass: 5.3269 7.3416 5.3801 3.8391 4.7605 4.7398 6.5149 6.0820 3.9263 8.1925 7.0677 5.3697 3.5644 1.1252 1.0485 3.1178 4.0388 1.9526 1.4231 1.4136 4.4971 3.5851 7.4780 6.0581 3.7390 3.5798 2.9392 3.8516 4.5981 4.0450 3.5595 3.8183 2.8849 3.5623 3.5384 4.1471 4.7594 3.8146 5.6330 6.1175 6.1370 5.5850 7.1089 5.5127 4.8160 6.2182 6.7279 4.3217 5.5696 5.0456 6.0971 5.0655 5.6956 5.7707 5.1384 5.5126 5.3717 6.7811 3.8291 3.0291 1.2490 1.6689 2.8056 1.7813 1.4601 2.6529 4.2939 2.5942 4.0116 5.7625 1.3351 1.8529 2.1297 4.2994 1.3540 3.2138 1.3714 2.6803 5.1828 4.8764 2.3566 3.2425 1.3346 2.0663 2.2091 2.0082 1.9638 1.2402 2.4665 3.1397 3.5864 1.5720 1.3391 1.6776 3.4775 3.9119 1.7775 1.2899 1.3941 1.3197 1.2602 1.2535 1.3414 1.7495 1.4516 2.2343 2.6543 1.3874 1.2929 1.2968 1.2261 1.2230 8.2789 4.4960 1.0504 1.0511 1.0960 1.0508 1.0491 1.0624 1.0635 1.0813 1.0483 2.2860 8.7671 6.5020 9.6922 1.0828 1.0415 1.0359 1.0822 1.0732 1.0429 1.0360 1.0881 1.0582 1.0875 1.1001 1.1004 1.0999 1.0995 1.0998 1.1004 1.1008 1.1009 1.1075 1.0902 1.0892 1.0958 1.0972
irintensity: 0.1549 0.0649 0.1297 1.9472 0.0586 0.5541 0.2140 2.0817 2.4262 5.4758 1.3208 0.7414 0.3312 0.0606 0.0774 0.7089 0.9095 0.3662 1.8192 2.3863 11.0658 2.4146 1.0933 6.4681 3.9462 5.9336 2.5279 9.7999 5.3770 1.6740 4.6460 2.2760 0.0955 6.1585 0.2353 1.2707 0.8557 17.4694 16.6969 4.5648 2.0469 9.5784 0.3646 0.7906 0.4163 0.8206 6.6490 62.7853 10.5960 26.6610 25.1524 6.2784 4.6259 55.9802 6.7635 45.7613 12.0864 10.2926 11.6429 14.0972 0.7727 52.1490 12.3610 2.7137 0.6705 9.1825 39.6975 0.8436 146.4887 248.8318 2.7459 49.6164 92.8113 76.2700 0.5339 36.2095 0.1748 10.0494 202.6516 142.5311 3.4898 11.6892 13.1747 19.1904 55.7763 53.4984 15.6057 5.5314 115.4887 379.6077 249.1975 52.3963 2.2805 7.2365 61.5010 151.1080 13.0596 2.3091 3.1767 9.4680 0.4378 1.5329 14.9762 3.5585 21.7011 34.3857 49.4413 0.1361 47.5228 44.7141 39.8040 16.5315 10.7430 63.5686 3.8704 4.1572 13.4254 2.1972 4.8462 1.0921 6.7331 23.9101 16.6270 4.7149 42.9891 9.1105 100.9509 17.0162 2.5290 9.5888 15.5964 21.9957 16.9384 17.0618 30.6105 22.2717 18.9644 2.2729 21.1617 1.5987 33.2189 26.6290 23.2710 19.0660 17.7275 8.3384 1.0014 1.0052 0.6350 0.5195
temp: 298.150 k
press: 1.00000 atm
elementType: 8 8 8 8 8 8 8 8 8 7 6 6 6 6 6 6 6 6 6 6 6 6 6 6 6 6 6 6 6 1 1 1 1 1 1 1 1 1 1 1 1 1 1 1 1 1 1 1 1 1 1 1
symmnumber: 1
zpe: 1056415.0 jmol-1
zpe.correction: 0.402367 hartree
zpe.thermalcorrener: 0.430102 hartree
zpe.thermalcorrenthalpy: 0.431047 hartree
zpe.thermalcorrgfe: 0.341574 hartree
zpe.sumelectzpe: -1467.299192 hartree
zpe.sumelectthermal: -1467.271457 hartree
zpe.sumelectthermalent: -1467.270513 hartree
zpe.sumelectthermalfe: -1467.359985 hartree
dipole: 4.8531 0.6238 -0.3958
dipole: 4.9090
quadrupole: -207.1119 -165.1533 -170.2306
quadrupole: 5.1809 -14.5186 5.4246
quadrupole: -26.2800 15.6786 10.6013 5.1809 -14.5186 5.4246
hfenergy: -1467.7015595 hartree
pointgroup: C01 [X(C19H23N1O9)]
dipole: 1.9122653 0.2588047 -0.079606 debye
polarizability: 346.0673854|-39.3114002|178.1546365|0.4921858|4.8047495|216.2560472 unknown
InChI: InChI=1S/C19H23NO9/c1-18(2)26-13-12(25-17-15(14(13)27-18)28-19(3,4)29-17)9-24-16(21)10-5-7-11(8-6-10)20(22)23/h5-8,12-15,17H,9H2,1-4H3
charge 0 multiplicity 1
52 atoms
O  1.980692 2.154419 0.896308
O  0.214808 1.044678 -0.226241
O  3.00774 -1.421167 0.334225
O  4.761334 0.652839 -0.977697
O  5.298113 -0.974331 0.671128
O  -0.622158 -1.754283 -0.316986
O  -1.084009 -1.381128 1.937463
O  -7.595824 0.496988 -0.033773
O  -6.971455 0.321534 -2.220598
N  -6.729784 0.238587 -0.955425
C  2.569208 1.389365 -0.22846
C  1.478634 0.321811 -0.505483
C  3.941958 0.891923 0.229801
C  3.978846 -0.484015 0.937758
C  1.625575 -0.898289 0.433209
C  0.532499 2.261272 0.606798
C  5.749691 -0.415896 -0.654229
C  0.772388 -2.116582 0.042409
C  0.223167 3.503578 -0.23777
C  -0.222807 2.200529 1.931751
C  7.140048 0.180554 -0.436526
C  5.663124 -1.489122 -1.736915
C  -1.447317 -1.369609 0.735464
C  -2.805567 -0.965541 0.260764
C  -3.790105 -0.670128 1.239133
C  -3.115299 -0.861104 -1.119572
C  -5.081914 -0.275061 0.848082
C  -4.403735 -0.466467 -1.525164
C  -5.366568 -0.180293 -0.532312
H  2.704917 2.040465 -1.113943
H  1.461543 0.005616 -1.561887
H  4.408342 1.661552 0.876827
H  3.83305 -0.44773 2.032375
H  1.405148 -0.583973 1.473272
H  0.760877 -2.849552 0.866638
H  1.175437 -2.574496 -0.874076
H  0.862405 3.537974 -1.13625
H  -0.829832 3.478514 -0.566247
H  0.39121 4.419867 0.354135
H  -1.307488 2.292769 1.75151
H  -0.033222 1.243505 2.443825
H  0.09779 3.030357 2.585073
H  7.832567 -0.599492 -0.076229
H  7.527961 0.591643 -1.383929
H  7.098714 0.987814 0.313484
H  5.902808 -1.051668 -2.721745
H  6.379931 -2.300449 -1.523983
H  4.644465 -1.906713 -1.759352
H  -3.521333 -0.755175 2.296545
H  -2.340465 -1.082849 -1.856818
H  -5.862725 -0.042695 1.576436
H  -4.674779 -0.374545 -2.579802
