program: Gaussian 09
title: 000272023
version: EM64L-G09RevD.01
frameworkgroup: C1[X(C12H17NO3)]
method: RPBEPBE
basis: SDD
operation: Freq
keyword: #p
keyword: freq=noraman
keyword: PBEPBE/SDD
title: #p freq=noraman PBEPBE/SDD
converged: YES YES NO NO
title: Mulliken charges:
elementType: O O O N C C C C C C C C C C C C H H H H H H H H H H H H H H H H H
charge: -0.239567 -0.186247 -0.247084 -0.628796 -0.206077 -0.181456 0.217398 -0.505862 0.233273 -0.476675 -0.163093 -0.168899 -0.536202 -0.176259 -0.187472 -0.734768 0.277464 0.252714 0.242528 0.227989 0.224487 0.226926 0.235224 0.358657 0.330489 0.231241 0.218051 0.216435 0.228061 0.232258 0.217192 0.237971 0.230096
chargesum: 0.00000
title: Mulliken charges with hydrogens summed into heavy atoms:
elementType: O O O N C C C C C C C C C C C C
charge: -0.239567 -0.186247 -0.247084 0.060351 0.071387 0.071258 0.217398 -0.035345 0.233273 -0.025262 0.072132 0.062342 -0.101715 0.051802 0.044786 -0.049509
polarizability: 1.70835781e+02 1.43386615e+01 1.32353588e+02 4.92222044e+00 -1.95748131e+00 1.28155453e+02
1716.lowfreq: -1.7449 -0.0007 -0.0004 0.0002 5.2964 7.4410 21.5284 40.2664 43.9013
frequency: 20.5144 40.2368 43.8958 57.6239 63.2211 80.2229 99.8741 117.6555 137.4154 168.8316 172.2587 199.0747 210.1727 227.9288 258.5376 271.6324 310.2045 346.1810 370.0036 407.8029 439.7087 467.2989 516.9155 557.7034 572.6369 584.3557 599.2647 660.9352 698.4254 761.0159 775.8477 796.6146 820.6592 842.7264 854.5647 886.3101 892.3373 931.8041 947.0645 978.0143 989.4032 992.6450 1018.7781 1045.6420 1056.6792 1061.0603 1066.0975 1073.4807 1083.6502 1107.3064 1156.1468 1171.3792 1187.3210 1205.7276 1215.2604 1255.2487 1265.1935 1285.8645 1288.7504 1298.2880 1310.0250 1317.2800 1330.2531 1348.5481 1396.3783 1411.3492 1448.3831 1453.4969 1459.2481 1460.0741 1474.7423 1605.7976 1626.5291 1648.6437 1675.5692 1682.5053 2951.2568 2966.5535 2973.1326 2994.7700 3033.8036 3036.0510 3044.0826 3064.4541 3068.2145 3073.7881 3076.6840 3084.4054 3092.9615 3100.9073 3106.3550 3468.1000 3637.3828
redmass: 4.2637 3.9352 7.5238 5.3018 5.0993 4.9052 4.3502 1.7881 2.1817 2.4804 3.4322 3.9759 1.3524 8.7275 2.7237 2.2627 5.4139 3.9432 2.9133 3.2312 3.2243 2.3165 2.9972 4.2927 1.1659 1.7062 2.3896 3.2754 3.7703 1.5263 1.5037 6.4806 5.6409 2.5907 3.3331 2.5620 2.0311 1.9804 1.7518 1.1409 1.5972 1.5923 1.7686 1.5321 2.4048 1.9171 1.4399 1.5333 1.5690 2.4804 2.4726 1.2173 1.4379 1.3701 1.8517 1.2422 1.5862 1.2714 1.2545 1.2489 1.2897 1.4493 2.0764 1.4476 1.2336 3.2018 1.0917 1.0891 1.0908 1.0482 1.0579 1.5398 7.4254 3.4085 6.0961 6.2586 1.0649 1.0363 1.0611 1.0619 1.0991 1.0937 1.0970 1.0921 1.0961 1.0957 1.0982 1.0886 1.0918 1.0917 1.0878 1.0480 1.1024
irintensity: 0.7473 2.0277 2.0689 7.1952 1.6053 4.7317 2.1951 0.9047 0.5517 3.6233 5.8817 1.2646 2.3742 1.3026 4.2505 0.9098 0.9044 1.3859 1.9655 3.3156 2.2692 2.2520 0.2199 10.2040 32.7100 137.7764 74.3451 8.2483 34.1709 5.0470 1.5702 8.2484 35.2023 1.8666 16.0927 4.9256 2.2756 12.7727 11.1158 28.4247 37.0896 47.4856 34.9366 0.5619 2.2199 1.6854 14.0224 7.5411 6.0907 5.7468 9.6069 7.4471 7.3610 17.4591 3.2173 6.0481 48.7280 5.2879 1.0599 1.3228 2.3615 17.3840 107.2970 9.1380 13.4081 14.9459 15.1317 16.7950 12.2653 18.6891 20.0955 66.7711 105.5946 257.5003 0.2100 2.4035 29.8961 27.3264 23.0847 28.1505 13.5586 3.7408 22.4494 15.4667 9.2886 9.6442 3.7815 47.1977 52.4585 8.0461 10.1027 135.3721 74.6686
temp: 298.150 k
press: 1.00000 atm
elementType: 8 8 8 7 6 6 6 6 6 6 6 6 6 6 6 6 1 1 1 1 1 1 1 1 1 1 1 1 1 1 1 1 1
symmnumber: 1
zpe: 702406.2 jmol-1
zpe.correction: 0.267532 hartree
zpe.thermalcorrener: 0.285581 hartree
zpe.thermalcorrenthalpy: 0.286525 hartree
zpe.thermalcorrgfe: 0.219562 hartree
zpe.sumelectzpe: -746.591712 hartree
zpe.sumelectthermal: -746.573664 hartree
zpe.sumelectthermalent: -746.572719 hartree
zpe.sumelectthermalfe: -746.639682 hartree
dipole: 3.9884 -3.9193 -2.6906
dipole: 6.2055
quadrupole: -82.4399 -107.4076 -104.0961
quadrupole: 12.5067 6.3156 2.5554
quadrupole: 15.5413 -9.4264 -6.1149 12.5067 6.3156 2.5554
hfenergy: -746.8592446 hartree
pointgroup: C01 [X(C12H17N1O3)]
dipole: 1.8446262 -0.5281712 -1.5096028 debye
polarizability: 152.2268116|23.4941338|152.6566705|2.2721649|-2.1983008|126.4613395 unknown
InChI: InChI=1S/C12H17NO3/c1-2-3-4-5-6-7-8-9(14)10-11(16-10)12(13)15/h2-3,5-6,10-11H,4,7-8,13H2,1H3
charge 0 multiplicity 1
33 atoms
O  -2.106669 0.84631 1.750333
O  -1.168408 -1.853868 2.28691
O  -2.197808 2.270115 -0.880697
N  0.131309 2.350889 -0.766466
C  -2.120752 -0.2506 0.733282
C  -1.040417 0.809042 0.702671
C  -1.730528 -1.643259 1.18121
C  -1.973855 -2.752342 0.160773
C  -1.107557 1.875832 -0.376315
C  -1.127729 -2.536441 -1.138673
C  0.347123 -2.335368 -0.845356
C  1.120016 -1.356149 -1.382863
C  2.598193 -1.156032 -1.074096
C  2.963382 0.301545 -0.828857
C  3.298946 0.830284 0.379662
C  3.707147 2.26771 0.625385
H  -2.922238 -0.147634 -0.010665
H  -0.051762 0.529367 1.091315
H  -1.701808 -3.71027 0.637759
H  -3.046924 -2.79039 -0.112331
H  -1.517653 -1.677352 -1.716728
H  -1.273551 -3.435322 -1.771548
H  0.797813 -3.042625 -0.130945
H  1.002414 1.956441 -0.402588
H  0.167654 3.065997 -1.493095
H  0.669339 -0.646337 -2.09499
H  3.200442 -1.5241 -1.932518
H  2.880299 -1.772354 -0.200104
H  2.969748 0.954375 -1.717756
H  3.301814 0.167257 1.259029
H  3.676361 2.867733 -0.302185
H  4.738584 2.31788 1.024268
H  3.056772 2.753365 1.378979
