program: Gaussian 09
title: 000272019
version: EM64L-G09RevD.01
frameworkgroup: C1[X(C15H18O3)]
method: RPBEPBE
basis: SDD
operation: Freq
keyword: #pfreq=noraman
keyword: PBEPBE/SDD
title: #p freq=noraman PBEPBE/SDD
converged: YES YES NO NO
title: Mulliken charges:
elementType: O O O C C C C C C C C C C C C C C C H H H H H H H H H H H H H H H H H H
charge: -0.278510 -0.216171 -0.196529 0.345815 -0.498253 -0.524076 -0.443451 -0.438379 -0.427719 0.504736 0.180618 0.031120 -0.689887 -0.429296 -0.374004 -0.226991 -0.236416 -0.244014 0.237368 0.216309 0.239141 0.247033 0.245217 0.219648 0.223824 0.213369 0.219922 0.219595 0.235362 0.236835 0.223804 0.234154 0.269620 0.226532 0.224733 0.228940
chargesum: 0.00000
title: Mulliken charges with hydrogens summed into heavy atoms:
elementType: O O O C C C C C C C C C C C C C C C
charge: -0.278510 -0.216171 -0.196529 0.345815 -0.044575 -0.037901 -0.198234 0.005093 0.005571 0.504736 0.180618 0.250715 0.006115 -0.195141 -0.104384 -0.000459 -0.011683 -0.015074
polarizability: 1.92476473e+02 -1.06416023e+01 1.38118254e+02 5.84505707e-01 -7.84467364e+00 1.54779358e+02
1716.lowfreq: -9.0671 -0.0004 0.0001 0.0006 7.4065 10.9604 31.1394 50.2818 63.7823
frequency: 31.0391 50.1527 63.6391 77.9802 90.4810 110.4839 142.7171 194.7790 211.3994 225.8506 230.8927 267.3587 273.7956 302.7099 354.9373 404.3223 406.0873 441.2988 476.2241 489.8336 506.1779 555.2573 593.8378 614.3584 621.9679 674.7721 702.8986 713.8063 737.2327 752.6544 793.7818 805.1177 830.0816 847.0483 855.9615 859.3033 879.5809 907.7484 910.7337 932.4135 955.3064 963.0362 981.0253 991.4853 998.6152 1024.4032 1027.9969 1045.9953 1055.0927 1068.4094 1084.1698 1086.1619 1119.7304 1153.8123 1158.4167 1172.5961 1186.4887 1191.0525 1194.6637 1204.1176 1226.6612 1251.2020 1258.8349 1275.2849 1292.3561 1305.5305 1312.9157 1317.6406 1331.3639 1343.0206 1349.4236 1383.8275 1396.7545 1442.6506 1457.3952 1459.5639 1464.1477 1465.1897 1469.4217 1481.2788 1488.1876 1591.8547 1608.9221 1655.6755 2985.8214 2992.9353 3001.5765 3008.2315 3009.9380 3023.6479 3031.8777 3056.0003 3061.3319 3077.5792 3092.1869 3114.1214 3120.8166 3121.5060 3128.7683 3142.4198 3158.3178 3169.2948
redmass: 3.9770 3.8493 2.9892 4.0496 6.0294 4.9471 2.4177 1.0861 2.1797 3.4828 4.5972 4.2979 2.9158 5.5744 3.7794 2.8573 4.4264 4.0229 4.1201 2.6512 4.4909 5.9210 2.2421 5.1672 4.8596 6.4110 2.3081 2.2185 2.4898 1.8891 2.9752 2.3881 4.5031 2.0645 1.2764 5.0257 2.8507 2.3709 2.7101 1.5247 1.9211 2.0716 1.4400 5.1772 1.3178 1.7596 2.1518 2.1667 1.9317 2.5010 1.6235 1.8076 2.7205 1.9705 2.9760 1.0795 2.1045 1.7811 1.1337 2.1120 1.5042 1.3502 1.4229 1.3837 1.3897 1.3025 1.2702 1.3138 1.5702 1.3036 1.4520 5.8782 1.2909 2.1342 1.0468 1.0811 1.0594 1.0710 1.0899 2.1780 1.0988 6.0258 6.0849 11.6698 1.0832 1.0644 1.0616 1.0631 1.0360 1.0645 1.0832 1.0986 1.0999 1.1043 1.1027 1.1002 1.1005 1.0858 1.0880 1.0935 1.0964 1.0985
irintensity: 0.4063 1.3530 0.2280 2.0292 0.5422 1.2102 0.5881 0.2596 0.3092 2.7885 1.8780 3.7215 2.0164 4.7094 1.7995 0.0447 2.4890 1.7817 6.3445 3.2495 8.3605 6.9699 0.9974 3.8893 6.0452 4.3930 10.2919 59.3068 51.4029 16.1844 1.8580 16.5420 1.0946 15.0501 4.9487 113.6703 3.6502 5.4637 21.3934 5.9231 10.5886 10.8121 0.1043 1.2094 0.7127 1.5619 7.0818 1.4057 70.1001 58.5403 10.2773 3.6865 55.1326 27.3872 165.4907 0.6501 30.8038 9.8719 5.2737 42.9775 1.7808 15.8272 5.7099 1.1110 9.9798 4.2101 8.8958 2.8999 15.2767 7.5562 17.3608 0.3113 44.6114 10.2196 5.5209 6.1267 3.1149 11.1750 15.4818 28.0548 9.4080 1.3325 10.2657 246.6946 50.9677 22.0564 33.2660 41.8230 10.5150 24.7332 8.3543 25.6229 21.6336 23.5985 38.7679 19.9373 17.1578 4.5941 2.8784 27.7588 23.2630 13.8826
temp: 298.150 k
press: 1.00000 atm
elementType: 8 8 8 6 6 6 6 6 6 6 6 6 6 6 6 6 6 6 1 1 1 1 1 1 1 1 1 1 1 1 1 1 1 1 1 1
symmnumber: 1
zpe: 780735.4 jmol-1
zpe.correction: 0.297366 hartree
zpe.thermalcorrener: 0.313597 hartree
zpe.thermalcorrenthalpy: 0.314541 hartree
zpe.thermalcorrgfe: 0.253148 hartree
zpe.sumelectzpe: -806.725021 hartree
zpe.sumelectthermal: -806.708791 hartree
zpe.sumelectthermalent: -806.707847 hartree
zpe.sumelectthermalfe: -806.769240 hartree
dipole: -2.1038 -3.3381 -2.1246
dipole: 4.4813
quadrupole: -94.8632 -112.7272 -108.0922
quadrupole: -5.0791 -2.8426 -12.9511
quadrupole: 10.3643 -7.4997 -2.8646 -5.0791 -2.8426 -12.9511
hfenergy: -807.0223877 hartree
pointgroup: C01 [X(C15H18O3)]
dipole: -0.8302256 1.2577817 0.9149878 debye
polarizability: 191.7754818|11.8472507|139.3642511|-1.3642974|-8.8837014|154.2343524 unknown
InChI: InChI=1S/C15H18O3/c1-11-17-14(16)13(12-7-3-2-4-8-12)15(18-11)9-5-6-10-15/h2-4,7-8,11,13H,5-6,9-10H2,1H3
charge 0 multiplicity 1
36 atoms
O  -1.412263 -0.364577 1.017808
O  -0.800157 -2.230553 -0.456077
O  0.323722 -1.838304 -2.408697
C  -1.203412 0.62647 -0.102719
C  -2.518547 0.831551 -0.905222
C  -0.978943 1.986335 0.608158
C  -0.009856 0.115238 -0.958528
C  -3.374027 1.716924 0.028097
C  -2.344498 2.745307 0.57599
C  1.382544 0.303558 -0.332884
C  -0.163536 -1.367144 -1.364456
C  -1.764004 -1.683261 0.573924
C  -1.734589 -2.632462 1.757451
C  2.417425 0.859081 -1.127003
C  1.678006 -0.089167 0.998231
C  3.718457 1.030716 -0.603856
C  2.977946 0.084382 1.52195
C  4.003628 0.644459 0.725451
H  -3.011829 -0.107039 -1.214371
H  -2.275753 1.387414 -1.832429
H  -0.179067 2.554675 0.101337
H  -0.630849 1.792751 1.636253
H  -0.013936 0.671916 -1.913455
H  -3.780182 1.105325 0.854658
H  -4.222615 2.193261 -0.493314
H  -2.282975 3.613324 -0.106808
H  -2.629652 3.130421 1.56996
H  -2.74502 -1.685555 0.056884
H  -1.965265 -3.656194 1.420506
H  -0.735348 -2.627541 2.222936
H  -2.482336 -2.320248 2.506042
H  2.206308 1.147187 -2.163879
H  0.888351 -0.519947 1.620884
H  4.50589 1.460695 -1.232889
H  3.191564 -0.222095 2.552333
H  5.012219 0.7740 1.133639
