program: Gaussian 09
title: 000272012
version: EM64L-G09RevD.01
frameworkgroup: C1[X(C16H22N2O)]
method: RPBEPBE
basis: SDD
operation: Freq
keyword: #p
keyword: freq=noraman
keyword: PBEPBE/SDD
title: #p freq=noraman PBEPBE/SDD
converged: YES YES NO NO
title: Mulliken charges:
elementType: O N N C C C C C C C C C C C C C C C C H H H H H H H H H H H H H H H H H H H H H H
charge: -0.277344 -0.080374 -0.327796 0.432710 -0.485432 -0.495816 -0.470727 -0.569264 -0.411249 -0.395088 -0.421741 0.119569 -0.476258 0.449866 -0.447069 -0.381702 -0.221534 -0.229586 -0.246343 0.208851 0.215353 0.196138 0.208241 0.215960 0.220267 0.237400 0.249529 0.193646 0.236608 0.210579 0.189936 0.222189 0.228236 0.317997 0.193567 0.220462 0.232228 0.263522 0.224458 0.223251 0.226762
chargesum: 0.00000
title: Mulliken charges with hydrogens summed into heavy atoms:
elementType: O N N C C C C C C C C C C C C C C C C
charge: -0.277344 -0.080374 -0.009799 0.432710 -0.061228 -0.091436 -0.034499 -0.082334 0.019005 0.005427 0.028684 0.119569 -0.062230 0.449866 -0.214842 -0.118181 0.002924 -0.006335 -0.019582
polarizability: 2.12889124e+02 -1.75375337e+00 1.78813429e+02 -1.66944391e+01 -2.63806383e+00 1.45450375e+02
1716.lowfreq: -11.7990 -5.6597 0.0002 0.0003 0.0005 6.0240 26.6142 33.1885 39.9502
frequency: 26.0923 33.0103 39.8295 70.1729 98.5188 113.6980 186.1545 192.3278 207.9859 230.6379 247.6676 288.1455 310.2007 325.8775 356.1645 379.8614 406.1621 408.1721 440.3148 458.9451 472.8799 486.9496 504.7351 524.4784 590.5594 609.7265 619.1896 646.8001 682.2378 705.2610 725.1951 740.3102 778.4058 805.5429 807.4693 820.3654 860.0080 865.5393 908.8245 913.2537 939.1153 943.0493 970.5569 982.8137 988.4467 990.6829 997.4544 1005.4009 1017.0893 1025.7097 1037.2548 1050.6987 1076.7083 1081.9531 1119.1487 1125.8327 1133.0670 1151.9196 1163.2250 1169.4322 1179.8286 1182.5542 1198.9207 1208.0316 1214.5831 1226.4682 1254.8372 1277.3310 1283.2400 1291.1664 1313.2230 1320.2863 1325.7243 1330.5494 1338.9217 1345.3699 1353.9717 1364.8234 1376.3285 1381.3607 1397.0889 1427.9455 1440.4011 1442.0282 1448.0597 1453.8718 1460.1153 1462.4806 1477.4987 1482.6310 1485.7644 1500.5531 1594.1223 1614.7273 1622.8761 2835.0299 2839.9175 2853.6918 2957.3139 2969.1795 2974.0116 2977.8154 2983.1182 2983.6721 3016.6663 3017.7349 3030.7447 3037.8405 3038.9194 3043.4180 3068.9506 3112.0103 3121.6364 3135.1874 3146.4270 3160.8947 3515.8803
redmass: 4.6398 4.4269 4.3545 4.3292 3.6918 4.7466 3.3242 3.2010 3.1274 3.2107 2.6059 1.9906 2.1768 2.5028 2.5182 2.2198 2.8270 2.6759 3.3278 3.1400 3.1648 3.3106 4.0479 2.2018 4.1589 3.0975 4.7338 2.8951 1.4552 2.2225 2.3998 1.5626 2.8679 1.7295 3.3644 2.9865 1.2496 2.0639 2.2424 1.5289 1.9167 2.4422 2.0429 1.3985 2.1990 3.3585 1.6289 1.7932 1.6729 2.0963 2.1960 2.0168 1.5970 2.1814 2.3602 1.9503 2.8167 1.8930 2.0894 1.0627 1.1121 1.0893 1.4728 1.4396 1.7428 1.3258 1.6343 1.4012 1.3935 1.4739 1.4047 1.9879 1.4801 1.5643 1.3274 1.5328 1.5565 1.5018 1.5889 3.2871 1.8082 1.7644 2.0916 1.0903 1.2140 1.0891 1.1170 1.0963 1.1784 1.8405 1.1187 1.1259 6.1676 6.1466 5.1204 1.0710 1.0720 1.0697 1.0652 1.0600 1.0614 1.0615 1.0690 1.0829 1.0950 1.0873 1.1024 1.0894 1.0999 1.1013 1.0920 1.0870 1.0862 1.0913 1.0955 1.1014 1.0759
irintensity: 0.5081 1.6446 0.9348 2.8688 1.4886 0.4031 2.1879 1.0191 2.4021 0.8890 0.6070 1.5176 0.6036 2.6157 5.2873 2.6154 0.3653 0.6546 4.7443 3.4574 15.1187 2.7628 5.4741 16.2701 1.3875 1.1090 0.0511 8.7501 102.7222 32.0340 5.1999 56.2848 19.4885 0.6931 3.5107 3.3233 0.2694 1.9363 2.5578 7.4916 7.8769 12.7257 7.2566 1.2999 10.0097 7.9321 5.5184 5.3716 4.7614 11.7946 2.3934 1.6915 15.4694 13.0364 26.1884 27.6307 7.8194 3.1720 11.4617 0.7035 2.2838 4.3158 5.2894 1.9026 3.0783 2.5352 11.0495 14.0800 3.9509 10.9241 15.1852 66.2538 15.6533 23.2853 15.9179 4.3396 10.5589 2.6125 17.6113 4.8333 1.8251 26.6515 11.5199 4.2866 7.0972 12.6670 12.8228 17.7875 4.7497 9.8549 7.6742 22.5464 1.0207 8.2010 314.2381 39.5103 36.3333 179.8127 48.4240 14.6894 36.8285 39.4930 13.9186 20.8406 55.3566 59.3486 18.1875 29.0537 6.7101 96.3308 12.7033 8.7648 0.2164 18.4996 33.5440 28.1566 15.5012
temp: 298.150 k
press: 1.00000 atm
elementType: 8 7 7 6 6 6 6 6 6 6 6 6 6 6 6 6 6 6 6 1 1 1 1 1 1 1 1 1 1 1 1 1 1 1 1 1 1 1 1 1 1
symmnumber: 1
zpe: 925640.3 jmol-1
zpe.correction: 0.352558 hartree
zpe.thermalcorrener: 0.369438 hartree
zpe.thermalcorrenthalpy: 0.370382 hartree
zpe.thermalcorrgfe: 0.306887 hartree
zpe.sumelectzpe: -806.203968 hartree
zpe.sumelectthermal: -806.187088 hartree
zpe.sumelectthermalent: -806.186144 hartree
zpe.sumelectthermalfe: -806.249639 hartree
dipole: 0.6471 3.6702 1.2405
dipole: 3.9278
quadrupole: -118.4438 -116.4005 -112.5076
quadrupole: -21.2702 -6.8372 -7.9103
quadrupole: -2.6599 -0.6165 3.2764 -21.2702 -6.8372 -7.9103
hfenergy: -806.5565259 hartree
pointgroup: C01 [X(C16H22N2O1)]
dipole: 0.3301261 0.993794 -1.1364165 debye
polarizability: 212.0237499|-17.9150522|149.6515515|-3.7988054|-10.4042519|175.4776261 unknown
InChI: InChI=1S/C16H22N2O/c19-15-12-16(6-9-17-15)7-10-18(11-8-16)13-14-4-2-1-3-5-14/h1-5,17H,6-13H2
charge 0 multiplicity 1
41 atoms
O  -4.476146 -1.78735 1.273943
N  0.696918 0.828377 0.515927
N  -4.47348 -0.898919 -0.861994
C  -2.184468 0.773961 -0.286242
C  -1.116755 -0.210729 -0.851276
C  -1.444517 2.049868 0.206402
C  -3.202949 1.175643 -1.388681
C  -3.000312 0.126835 0.868948
C  0.058698 -0.450465 0.11816
C  -0.275983 1.741122 1.161915
C  -3.969541 -0.036029 -1.949363
C  -4.021941 -0.935263 0.448284
C  1.911084 0.626254 1.340305
C  3.079951 0.024789 0.564018
C  3.972006 -0.876631 1.194944
C  3.323522 0.399508 -0.78162
C  5.093563 -1.387644 0.501499
C  4.439123 -0.113714 -1.479032
C  5.331197 -1.007159 -0.83916
H  -0.709476 0.210652 -1.791975
H  -1.577265 -1.187698 -1.094355
H  -2.160197 2.732554 0.70723
H  -1.033875 2.583598 -0.673902
H  -2.681122 1.679734 -2.224968
H  -3.922875 1.903705 -0.963288
H  -3.567745 0.914677 1.406096
H  -2.355275 -0.350798 1.625637
H  -0.293824 -1.019372 1.017717
H  0.820225 -1.079709 -0.376333
H  0.246398 2.681871 1.4201
H  -0.669183 1.313785 2.121365
H  -4.826356 0.309518 -2.559183
H  -3.309293 -0.622672 -2.621522
H  -5.161753 -1.621265 -1.093537
H  1.705581 -0.007706 2.241394
H  2.211036 1.623539 1.722615
H  3.787844 -1.181876 2.233096
H  2.619705 1.085765 -1.265895
H  5.775067 -2.083956 1.003567
H  4.615738 0.182573 -2.519685
H  6.197779 -1.404374 -1.379854
