program: Gaussian 09
title: 000272039
version: EM64L-G09RevD.01
frameworkgroup: C1[X(C15H20N4O5)]
method: RPBEPBE
basis: SDD
operation: Freq
keyword: #p
keyword: freq=noraman
keyword: PBEPBE/SDD
title: #p freq=noraman PBEPBE/SDD
converged: YES YES NO NO
title: Mulliken charges:
elementType: O O O O O N N N N C C C C C C C C C C C C C C C H H H H H H H H H H H H H H H H H H H H
charge: -0.248888 -0.267076 -0.255444 -0.252459 -0.466414 -0.163275 -0.057378 -0.084961 -0.627369 -0.098357 -0.144996 -0.103063 -0.061802 0.298429 -0.374128 -0.721346 0.116174 -0.204757 0.126440 -0.424331 -0.223028 0.133424 -0.679944 -0.373388 0.267594 0.248091 0.288677 0.254235 0.210756 0.255850 0.237191 0.254444 0.234755 0.333288 0.243145 0.351356 0.201914 0.227569 0.209735 0.220873 0.229955 0.238316 0.320321 0.329876
chargesum: 0.00000
title: Mulliken charges with hydrogens summed into heavy atoms:
elementType: O O O O O N N N N C C C C C C C C C C C C C C C
charge: -0.248888 -0.267076 -0.255444 -0.252459 -0.115058 -0.163275 -0.057378 -0.084961 0.022829 0.169237 0.103095 0.185613 0.192433 0.298429 0.092479 0.005043 0.116174 0.128530 0.126440 -0.181187 0.206455 0.133424 -0.019381 -0.135072
polarizability: 2.60306115e+02 -1.87817360e+01 1.93352592e+02 1.43345194e+01 2.31555240e+01 1.68592966e+02
1716.lowfreq: -0.0005 0.0003 0.0006 2.2401 7.0836 13.9949 22.8771 27.4179 39.2123
frequency: 22.5774 27.2721 39.2048 50.4672 66.7176 78.8811 93.1373 115.1134 127.4618 134.6950 156.3593 178.7706 197.1292 208.3619 219.0328 236.9848 241.0336 245.7037 263.5256 274.7867 298.4987 307.6161 320.4672 327.3022 386.2829 396.6698 412.0974 497.8144 508.7496 522.9042 533.7225 535.6374 559.4104 569.6325 603.6187 616.0586 629.2862 667.6702 671.1862 686.5459 723.8826 726.3576 747.8794 753.1296 787.5087 803.0815 804.9301 818.5042 830.5514 857.2851 860.1440 860.9741 896.3998 911.1709 914.5187 919.8522 922.3849 955.2957 969.7341 971.4936 979.3333 1020.9040 1038.9899 1044.3302 1057.5618 1060.0917 1094.9505 1098.3074 1110.9607 1137.7878 1140.1363 1164.0304 1171.7637 1197.3158 1209.1668 1231.8393 1241.6009 1251.6212 1258.4372 1264.4063 1272.7163 1285.4026 1297.3423 1310.9691 1322.0906 1326.8346 1334.2991 1342.1817 1362.3578 1365.9930 1378.1809 1393.2880 1395.6940 1411.7178 1428.7511 1443.0818 1445.4234 1458.1885 1461.2798 1467.4313 1480.1033 1491.5530 1496.3603 1541.2336 1578.1296 1621.8522 2968.2358 2984.2441 2993.0106 3019.6550 3026.2472 3034.4171 3039.0572 3055.9589 3071.8396 3090.5298 3098.9157 3100.6839 3122.6523 3130.8151 3162.2812 3186.5663 3215.1746 3549.9473 3584.3456 3708.2541
redmass: 3.7800 5.2422 4.4633 3.6886 2.6802 4.4875 3.6810 4.4086 4.1508 4.1900 4.5054 2.9965 1.5062 3.2000 2.3015 1.3117 3.7785 2.1448 3.1068 4.2858 3.5747 3.0509 3.0725 2.8447 1.8084 2.0279 4.6231 5.1962 6.6760 1.1463 4.8444 4.5080 3.9858 4.8134 7.6094 4.3522 5.3187 9.5195 5.6759 6.4177 5.8142 6.4364 2.0606 2.3589 3.2568 5.4568 4.4521 1.1088 5.7611 4.9594 3.3769 4.2314 2.4564 2.2014 2.1356 1.6628 1.9706 2.4324 5.9300 2.2488 5.5143 3.5219 3.2818 3.7425 1.6331 2.3725 1.8480 1.9165 1.9893 1.9627 1.5736 2.2415 1.3029 1.8118 1.9966 1.4730 1.6876 2.1750 1.4583 1.3901 1.8333 1.6630 1.3621 1.8839 4.9939 1.4678 1.3992 2.0497 3.6284 1.2783 1.2814 1.2788 1.2694 1.6349 3.0329 3.1581 1.0966 1.0505 1.0413 1.0463 1.0466 1.0833 4.5537 6.2085 3.0285 1.7497 1.0577 1.0669 1.0360 1.0360 1.0852 1.1044 1.0862 1.0864 1.0883 1.0989 1.0984 1.1014 1.0999 1.1010 1.0920 1.0952 1.1046 1.0450 1.0668 1.1043
irintensity: 0.2011 0.3738 2.4472 0.9147 0.1966 1.6750 14.1226 1.1267 5.2001 5.2373 4.4441 7.5863 2.4247 9.4389 68.7485 89.7602 1.5133 52.5237 6.6317 2.3238 2.6149 7.9650 6.8722 12.2839 83.6963 123.2662 11.5740 5.6158 2.9324 67.2337 8.5703 4.9833 2.7626 13.9408 5.1785 16.7183 4.7436 0.9349 7.2129 12.6361 8.2920 17.5123 83.9027 58.0806 163.6367 13.1187 35.2798 1.8837 33.7951 3.0042 74.7178 30.7252 47.0839 58.6834 79.0245 26.3683 49.5221 1.3867 139.6617 22.4835 47.0040 15.6230 110.5133 99.1509 11.1749 61.6843 13.0634 48.4290 85.3459 121.4351 24.5269 5.1220 41.8135 35.0565 19.1870 3.8669 45.7069 61.8750 54.3544 41.1445 18.3488 23.3899 4.4955 81.9725 3.7324 8.1783 12.5696 11.1099 111.9914 0.8706 1.4992 28.6594 42.2995 8.7336 57.0916 21.4073 8.0358 4.0570 12.6592 8.8886 7.8000 3.9872 89.0388 52.4887 107.6646 504.0521 48.8777 47.9300 23.8978 5.6706 37.4679 21.2231 28.5606 8.3986 20.0631 34.5072 11.2070 41.2211 10.2171 13.5527 20.9921 71.3633 12.4672 101.2597 8.2596 31.2526
temp: 298.150 k
press: 1.00000 atm
elementType: 8 8 8 8 8 7 7 7 7 6 6 6 6 6 6 6 6 6 6 6 6 6 6 6 1 1 1 1 1 1 1 1 1 1 1 1 1 1 1 1 1 1 1 1
symmnumber: 1
zpe: 913302.7 jmol-1
zpe.correction: 0.347859 hartree
zpe.thermalcorrener: 0.370610 hartree
zpe.thermalcorrenthalpy: 0.371554 hartree
zpe.thermalcorrgfe: 0.294879 hartree
zpe.sumelectzpe: -1176.887903 hartree
zpe.sumelectthermal: -1176.865152 hartree
zpe.sumelectthermalent: -1176.864208 hartree
zpe.sumelectthermalfe: -1176.940883 hartree
dipole: -2.9885 2.3795 4.2919
dipole: 5.7457
quadrupole: -125.5180 -132.4112 -137.0743
quadrupole: 7.9602 10.0891 1.8122
quadrupole: 6.1498 -0.7433 -5.4065 7.9602 10.0891 1.8122
hfenergy: -1177.2357617 hartree
pointgroup: C01 [X(C15H20N4O5)]
dipole: 1.2928012 -0.6378907 1.7412121 debye
polarizability: 260.9840927|-18.0399664|184.7767065|-14.4174909|-25.3588436|176.490874 unknown
InChI: InChI=1S/C15H20N4O5/c1-3-21-15(2)23-10-9(6-20)22-14(11(10)24-15)19-5-4-8-12(16)17-7-18-13(8)19/h4-5,7,9-11,14,20H,3,6,16H2,1-2H3
charge 0 multiplicity 1
44 atoms
O  0.162885 -1.714571 -1.302955
O  1.694693 1.286462 -0.441526
O  3.071977 -0.402002 -1.260891
O  4.003726 1.122383 0.207422
O  0.969766 -3.064881 1.457665
N  -1.343963 -0.438356 0.092353
N  -2.621534 1.185512 -1.244557
N  -4.908791 1.547079 -0.442584
N  -5.820362 0.459362 1.420992
C  1.154289 0.017679 0.095968
C  2.229539 -1.059801 -0.232466
C  -0.11966 -0.392952 -0.69955
C  1.482116 -2.238847 -0.867568
C  3.074469 0.999221 -0.909672
C  1.307531 -3.448199 0.070391
C  3.398261 1.863887 -2.114852
C  -2.492675 0.30075 -0.21383
C  -1.613626 -1.239383 1.220532
C  -3.494995 -0.030952 0.751404
C  -2.92025 -1.00973 1.648405
C  4.078069 2.471473 0.822344
C  -4.741566 0.651552 0.585213
C  4.826523 2.317951 2.145372
C  -3.854957 1.761101 -1.290686
H  0.952507 0.129049 1.173017
H  2.861123 -1.323171 0.632964
H  -0.309264 0.332746 -1.509521
H  2.005866 -2.566919 -1.785342
H  2.220865 -4.077231 0.050919
H  0.452086 -4.043407 -0.286607
H  4.442082 1.692055 -2.423098
H  2.722682 1.604825 -2.944208
H  3.261317 2.929705 -1.871211
H  -0.857027 -1.932616 1.589541
H  -3.391443 -1.502341 2.497794
H  1.798048 -2.917405 1.977241
H  4.621434 3.155025 0.1389
H  3.051341 2.856065 0.976221
H  4.948806 3.30356 2.630655
H  4.273131 1.655961 2.833747
H  5.827737 1.884918 1.977278
H  -4.029389 2.479105 -2.097475
H  -5.782131 -0.189974 2.200628
H  -6.672438 0.981713 1.227632
