program: Gaussian 09
title: 000272016
version: EM64L-G09RevD.01
frameworkgroup: C1[X(C17H14FNO2S)]
method: RPBEPBE
basis: SDD
operation: Freq
keyword: #p
keyword: freq=noraman
keyword: PBEPBE/SDD
title: #p freq=noraman PBEPBE/SDD
converged: YES YES NO NO
title: Mulliken charges:
elementType: S F O O N C C C C C C C C C C C C C C C C C H H H H H H H H H H H H H H
charge: 0.207047 -0.210224 -0.195408 -0.227172 -0.228743 -0.349155 -0.319804 0.185344 0.184678 0.088572 0.111082 -0.736240 -0.350830 -0.356381 -0.208775 -0.208472 -0.186447 -0.136878 -0.219533 -0.386385 -0.353487 0.317914 0.231821 0.246255 0.247955 0.234555 0.302943 0.262252 0.271383 0.271005 0.241278 0.241215 0.263624 0.251932 0.256134 0.256944
chargesum: 0.00000
title: Mulliken charges with hydrogens summed into heavy atoms:
elementType: S F O O N C C C C C C C C C C C C C C C C C
charge: 0.207047 -0.210224 -0.195408 -0.227172 -0.228743 0.128921 0.162707 0.185344 0.184678 0.088572 0.111082 -0.171045 -0.079447 -0.085376 0.032503 0.032744 -0.186447 0.126746 0.032399 -0.130250 -0.096543 0.317914
polarizability: 2.15127648e+02 -3.54755717e+01 2.39094175e+02 -8.27394755e-01 -5.73876488e+00 1.69751355e+02
1716.lowfreq: -9.2582 -4.0076 -2.8058 -0.0014 -0.0011 -0.0008 5.1372 14.5154 26.5077
frequency: -8.4391 14.4427 26.5060 35.0910 57.2100 85.8566 125.8553 138.4250 153.7024 170.0882 188.6527 204.4872 224.5851 242.5990 274.4569 301.4679 324.3165 341.6659 364.7420 394.1586 409.4183 410.0424 443.6747 455.2291 496.3520 514.4248 524.0234 585.4640 589.7321 622.8189 658.6895 671.3199 686.2236 688.7007 696.4421 713.0340 753.4445 784.6588 790.2834 796.3887 811.0491 812.9099 824.1938 881.4155 907.8689 918.1021 937.0788 952.8637 975.8274 989.8901 998.7928 1007.5811 1013.4778 1021.2146 1046.8642 1065.9430 1073.0100 1105.0213 1115.8666 1155.8660 1159.6745 1170.9148 1172.1359 1200.5524 1205.3741 1252.4285 1281.7287 1284.7685 1290.7755 1319.7870 1327.9721 1344.8289 1360.4557 1370.9587 1396.1735 1417.3986 1450.6295 1453.9970 1456.1493 1463.4030 1466.7825 1476.9617 1592.6590 1595.1022 1615.2179 1616.6761 1623.4393 1674.8545 3006.6019 3008.5297 3031.4989 3064.7385 3076.4768 3109.8985 3141.3832 3148.1228 3151.0051 3154.3106 3165.5314 3173.6744 3175.7710 3177.5285
redmass: 8.1202 7.1458 4.1271 6.7269 7.0479 4.6020 5.6473 5.0671 5.6197 5.2700 3.6423 3.6550 5.0861 6.4406 2.8256 6.1503 8.4920 7.8813 8.5190 4.6327 3.1148 3.1725 4.6715 4.8508 2.8509 3.7963 7.1183 8.1956 7.7068 7.1345 4.8010 4.3529 6.0992 4.6492 3.9883 2.8232 1.4278 5.3279 6.9257 1.6656 1.7492 1.9040 1.5306 3.8173 1.3875 3.3335 1.3155 1.3459 1.4114 3.0814 3.4838 1.3489 2.4538 1.9892 3.0538 3.2241 2.6586 1.3275 2.7379 1.4405 1.3036 1.1677 1.9450 2.0864 2.7959 1.2623 1.2271 1.4202 1.2544 1.2978 3.2110 1.3798 5.7033 1.4852 3.8250 6.0219 1.2789 2.4444 1.7522 1.1978 1.3431 1.6489 7.5846 6.4278 8.7542 8.1632 9.4368 11.7286 1.0614 1.0616 1.0619 1.1006 1.1019 1.1039 1.0865 1.0894 1.0888 1.0906 1.0957 1.0962 1.1004 1.0968
irintensity: 0.3181 0.1627 0.2614 0.2502 0.8189 5.7679 0.8802 0.2877 5.3360 3.6318 0.9861 0.7802 1.1211 0.2692 2.2713 2.0170 5.5802 10.1584 0.4258 4.4276 0.0099 1.5754 6.3498 0.2309 24.3148 4.9541 9.0903 2.7721 28.3334 0.4058 0.4188 7.3740 8.6397 5.1656 0.8919 74.3756 23.2545 0.0094 7.1479 29.5004 0.5881 1.0907 93.6202 20.3533 0.0468 50.4532 0.3736 0.8104 2.4203 22.0986 17.9899 0.0091 14.0154 7.0197 10.3328 22.1162 11.2844 9.0765 11.3896 28.5477 1.3621 7.5081 5.1745 53.6953 11.2041 7.5133 9.5716 1.8145 2.4843 44.6614 191.3536 17.7650 5.0894 50.7537 1.2716 8.6371 24.5203 12.7131 1.0606 7.3207 95.3186 72.9511 5.1560 4.8755 175.9387 93.0445 191.4008 69.6090 10.1302 21.6933 15.2653 22.1145 3.0000 7.7039 1.5076 3.3046 1.6471 4.6187 5.1225 3.4493 18.4519 4.0674
temp: 298.150 k
press: 1.00000 atm
elementType: 16 9 8 8 7 6 6 6 6 6 6 6 6 6 6 6 6 6 6 6 6 6 1 1 1 1 1 1 1 1 1 1 1 1 1 1
symmnumber: 1
zpe: 706995.3 jmol-1
zpe.correction: 0.269280 hartree
zpe.thermalcorrener: 0.287809 hartree
zpe.thermalcorrenthalpy: 0.288753 hartree
zpe.thermalcorrgfe: 0.220243 hartree
zpe.sumelectzpe: -1357.789163 hartree
zpe.sumelectthermal: -1357.770635 hartree
zpe.sumelectthermalent: -1357.769691 hartree
zpe.sumelectthermalfe: -1357.838200 hartree
dipole: -3.5348 0.3689 -0.3886
dipole: 3.5752
quadrupole: -125.3595 -131.3992 -141.8578
quadrupole: -15.2696 9.2065 -1.2440
quadrupole: 7.5127 1.4730 -8.9856 -15.2696 9.2065 -1.2440
hfenergy: -1358.0584435 hartree
pointgroup: C01 [X(C17H14F1N1O2S1)]
dipole: 1.3749641 0.2921688 0.0512037 debye
polarizability: 206.6996731|33.0393373|239.8728135|2.8851675|21.3441971|177.4006905 unknown
InChI: InChI=1S/C17H14FNO2S/c18-12-6-8-13(9-7-12)22-11-3-10-19-16(20)14-4-1-2-5-15(14)17(19)21/h1-2,4-9H,3,10-11H2
charge 0 multiplicity 1
36 atoms
S  -3.207139 -2.594291 0.200498
F  -3.63076 3.395788 0.921256
O  2.330746 -0.652499 -2.881905
O  1.157021 -1.461127 1.610321
N  1.565422 -1.349678 -0.735568
C  0.847591 -2.556455 -1.18719
C  -0.702349 -2.415582 -1.178382
C  2.852526 0.599532 -0.791552
C  2.506979 0.344964 0.557783
C  2.26098 -0.481877 -1.640907
C  1.675766 -0.900354 0.608913
C  -1.348052 -2.944604 0.116633
C  3.628601 1.710888 -1.151777
C  2.926438 1.192097 1.593828
C  4.057282 2.576098 -0.110965
C  3.712406 2.320414 1.240461
C  -3.248949 -0.766467 0.411052
C  -2.248475 -0.041576 1.104823
C  -4.379588 -0.08497 -0.107935
C  -2.369283 1.356638 1.271371
C  -4.520451 1.308858 0.068766
C  -3.505168 1.999845 0.752154
H  1.164228 -3.406846 -0.555034
H  1.202683 -2.738462 -2.216505
H  -0.96682 -1.353547 -1.334012
H  -1.118123 -2.971626 -2.038767
H  -0.85907 -2.546451 1.01856
H  -1.297273 -4.046972 0.166214
H  3.889494 1.897907 -2.198021
H  2.656191 0.983647 2.633744
H  4.663827 3.455247 -0.352927
H  4.058835 3.005465 2.021523
H  -1.378444 -0.548839 1.532945
H  -5.147352 -0.641408 -0.655336
H  -1.605902 1.932154 1.803101
H  -5.387016 1.848589 -0.32366
