program: Gaussian 09
title: 000272004
version: EM64L-G09RevD.01
frameworkgroup: C1[X(C10H11BrO)]
method: RPBEPBE
basis: SDD
operation: Freq
keyword: #p
keyword: freq=noraman
keyword: PBEPBE/SDD
title: #p freq=noraman PBEPBE/SDD
converged: YES YES NO NO
title: Mulliken charges:
elementType: Br O C C C C C C C C C C H H H H H H H H H H H
charge: 0.011982 -0.275037 0.349637 -0.591934 0.252564 0.349134 -0.718732 -0.718634 -0.389027 -0.393485 -0.242773 -0.201092 0.242859 0.242925 0.209001 0.234771 0.238558 0.208975 0.238503 0.234889 0.240689 0.230759 0.245468
chargesum: 0.00000
title: Mulliken charges with hydrogens summed into heavy atoms:
elementType: Br O C C C C C C C C C C
charge: 0.011982 -0.275037 0.349637 -0.106149 0.252564 0.349134 -0.036403 -0.036267 -0.148338 -0.393485 -0.012014 0.044377
polarizability: 1.54921883e+02 -1.62263325e+00 1.45236458e+02 1.12898700e-02 -2.66098719e-03 6.99437768e+01
1716.lowfreq: -29.9696 -5.1321 -0.0005 -0.0005 0.0003 3.9231 7.7445 88.1194 117.0747
frequency: -29.0929 88.1186 117.0709 191.4427 216.8250 235.5023 253.7697 280.9200 306.3290 324.9802 326.6232 434.2276 481.1644 485.4068 510.3008 534.3827 580.8987 657.2886 712.4610 729.4919 762.1599 815.4527 855.5594 868.3476 889.0171 917.3040 939.9911 956.9991 965.3100 1004.7613 1051.2067 1094.7859 1114.0447 1143.3892 1176.5257 1213.6560 1236.1033 1251.9194 1277.5552 1282.6375 1379.8545 1388.2163 1394.9452 1441.1547 1443.4681 1452.9018 1464.1803 1464.3423 1471.5189 1485.0950 1582.3262 1609.8866 2985.0201 2987.8521 2992.5508 3042.1372 3081.7701 3087.6377 3096.4812 3101.8257 3135.9816 3152.9585 3172.3925
redmass: 3.2109 3.9350 7.5371 3.4930 1.1213 3.8197 1.1290 5.1024 3.1767 2.8272 2.4444 2.6577 2.9726 4.4835 4.2543 3.7028 6.4270 6.1045 4.8499 7.4932 1.2476 3.8502 5.1377 5.2209 1.4007 1.6416 1.3593 1.3245 1.8502 1.3628 2.1230 2.8100 1.2870 1.6628 1.6759 1.4809 2.5178 2.2384 2.4896 2.3026 1.2477 4.0265 1.3192 2.9550 3.3174 1.0515 1.0979 1.0498 1.0728 1.0559 7.3595 8.3632 1.0356 1.0427 1.0530 1.1037 1.0992 1.0991 1.1011 1.1001 1.0875 1.0918 1.0987
irintensity: 0.3374 1.8434 0.6649 0.3024 0.7072 5.2838 0.3324 0.8864 1.0930 1.9914 1.9837 1.8346 0.0945 0.0190 5.4651 0.0847 2.1484 11.8768 17.5441 14.3637 61.9394 10.6825 57.5565 45.9997 0.0005 1.1548 0.1350 0.9962 8.0081 0.0796 31.9164 85.5124 3.9382 25.0132 1.2259 25.3177 14.7350 8.4520 16.0169 109.4549 30.9714 13.9811 22.5572 77.9703 59.1502 2.2665 22.3872 4.3166 6.6665 9.7439 29.3585 16.9547 15.4318 8.1611 40.1838 14.1298 7.9495 41.2495 8.9440 34.8927 3.7315 10.3081 15.6968
temp: 298.150 k
press: 1.00000 atm
elementType: 35 8 6 6 6 6 6 6 6 6 6 6 1 1 1 1 1 1 1 1 1 1 1
symmnumber: 1
zpe: 476702.5 jmol-1
zpe.correction: 0.181566 hartree
zpe.thermalcorrener: 0.192091 hartree
zpe.thermalcorrenthalpy: 0.193035 hartree
zpe.thermalcorrgfe: 0.144999 hartree
zpe.sumelectzpe: -475.466215 hartree
zpe.sumelectthermal: -475.455691 hartree
zpe.sumelectthermalent: -475.454747 hartree
zpe.sumelectthermalfe: -475.502783 hartree
dipole: -3.5156 1.8397 -0.0026
dipole: 3.9679
quadrupole: -69.7235 -75.4584 -82.4854
quadrupole: 2.4880 0.0043 -0.0036
quadrupole: 6.1656 0.4307 -6.5963 2.4880 0.0043 -0.0036
hfenergy: -475.6477818 hartree
pointgroup: C01 [X(C10H11Br1O1)]
dipole: 0.8222343 -1.3264716 0.0377123 debye
dipolederiv: -0.0636815 0.092344 -0.0033262 0.1208006 -0.6371389 0.0288981 -0.0053519 0.0304229 -0.0281272 -1.6002649 -0.1482342 0.0628624 -0.3277804 -0.3390116 0.0155083 0.0737012 0.0077829 -0.3201913 1.0136239 -0.008351 -0.0233161 -0.2629289 0.2174103 0.0241306 -0.0091118 0.013343 0.4562293 -0.1840911 -0.1234181 0.0202952 0.0234245 -0.0662178 0.0092174 0.0123837 0.0153637 0.119805 0.0847979 0.106156 -0.0140223 -0.5442576 0.0034675 0.0180888 0.0211536 -0.0095959 -0.0943554 1.0650591 0.2683534 -0.0556195 0.9901688 -0.1997311 -0.0252312 -0.0960807 0.0055457 0.1091962 -0.0640558 -0.0314641 0.0447337 0.0108732 0.0612561 0.0207444 0.0787424 0.0049047 -0.1306795 -0.0745979 -0.0375341 -0.0453447 -0.0000618 0.0567066 -0.0411732 -0.0839088 -0.0217172 -0.1158563 0.1077441 -0.0921397 -0.0054386 0.08337 0.0694343 -0.0152812 -0.0150793 -0.0079346 -0.1416677 -0.1795385 -0.327583 0.0188837 -0.2209477 1.1264553 -0.0622664 0.013408 -0.057929 -0.1552315 -0.1082037 0.0082567 -0.0040658 0.0997398 -0.0994392 -0.0094846 -0.009135 -0.0054988 -0.1914348 0.0032977 0.1377944 -0.0117315 -0.0468605 -0.1778209 0.0067996 -0.0015566 -0.0010791 -0.0925949 -0.0148809 0.0637315 -0.0402405 0.0449642 0.0331125 0.0741608 -0.0780178 0.1072002 -0.0465449 -0.0054697 0.0573875 0.0306137 0.0456669 0.0121859 -0.0851238 0.0701043 -0.1194736 -0.0356395 -0.08268 0.0911351 0.025932 0.1401078 0.0027343 -0.0052184 0.0183347 0.0288897 0.0778295 0.0191586 -0.0312265 -0.1172064 -0.0383322 0.0753978 -0.042904 -0.0907178 -0.0304837 -0.0611587 0.0742898 -0.0549534 0.0218615 -0.1106769 -0.0933199 0.0349646 0.0150737 -0.017484 0.0834629 -0.0859312 0.0861683 -0.0218379 0.1385079 -0.000533 0.0024006 -0.0199813 -0.0275043 0.0841315 0.0716591 -0.0548405 -0.0150167 -0.1136595 -0.0922026 -0.0061732 -0.0017724 0.0413982 0.0848002 0.0359578 -0.0165314 0.1114812 -0.0254927 0.0820126 0.0288053 0.0860492 0.0157598 -0.0843638 0.0879942 0.0449179 0.0003651 0.0138353 -0.1029634 0.0136635 0.0021088 0.0122353 0.1535615 -0.0582426 -0.0894955 0.0147997 -0.0877152 -0.0110546 0.0138735 0.0146717 0.0139809 0.1692547 -0.0419442 0.0595267 0.005338 0.0672543 0.0792596 0.0016004 0.0049819 0.0018731 0.1595748 unknown
polarizability: 150.8482705|-5.2048137|148.9405148|-3.1883663|-4.1750834|70.3133321 unknown
InChI: InChI=1S/C10H11BrO/c1-10(2)6-7-4-3-5-8(11)9(7)12-10/h3-5H,6H2,1-2H3
charge 0 multiplicity 1
23 atoms
Br -1.804996 2.823909 -0.114226
O  0.899437 1.03795 -0.130322
C  2.058981 0.027274 -0.124093
C  1.378095 -1.385026 -0.018795
C  -0.111618 -1.08262 0.03074
C  -0.289807 0.321935 -0.039313
C  2.806192 0.238385 -1.448708
C  2.912369 0.376414 1.103765
C  -1.223302 -1.934884 0.125971
C  -1.578593 0.886068 -0.015518
C  -2.524478 -1.368857 0.150592
C  -2.701462 0.033459 0.080093
H  1.718714 -1.918122 0.888142
H  1.639237 -2.013224 -0.890619
H  3.683576 -0.432494 -1.504626
H  2.145892 0.025139 -2.307371
H  3.15598 1.281636 -1.531041
H  3.793045 -0.290096 1.159963
H  3.264855 1.420268 1.043306
H  2.32566 0.261843 2.031877
H  -1.092463 -3.021175 0.180416
H  -3.404498 -2.01554 0.224315
H  -3.706011 0.46676 0.099052
