program: Gaussian 09
title: 000272001
version: EM64L-G09RevD.01
frameworkgroup: C1[X(C6H9Cl)]
method: RPBEPBE
basis: SDD
operation: Freq
keyword: #pfreq=noraman
keyword: PBEPBE/SDD
title: #p freq=noraman PBEPBE/SDD
converged: YES YES NO NO
title: Mulliken charges:
elementType: Cl C C C C C C H H H H H H H H H
charge: -0.076849 -0.368912 -0.298468 -0.485660 -0.598850 0.202840 -0.505204 0.214900 0.214782 0.219631 0.219731 0.231770 0.231751 0.261450 0.261434 0.275654
chargesum: 0.00000
title: Mulliken charges with hydrogens summed into heavy atoms:
elementType: Cl C C C C C C
charge: -0.076849 0.060771 0.140894 -0.022139 -0.075966 0.202840 -0.229550
polarizability: 1.10320917e+02 1.30658047e+01 5.59804112e+01 6.36682899e-04 -3.06461986e-04 4.66398178e+01
1716.lowfreq: -42.6874 -8.7332 -5.3738 0.0024 0.0037 0.0040 47.5263 83.0247 84.7344
frequency: 47.4259 83.0183 84.0180 126.1950 172.7721 291.2902 327.5229 359.0508 503.7443 636.4675 642.5256 677.5221 736.9015 775.3249 887.0696 933.2794 1020.7490 1044.0504 1051.5047 1079.0689 1118.6026 1228.3055 1235.9482 1279.1908 1283.5797 1286.3266 1327.8807 1347.8915 1455.6816 1460.0209 1468.6910 1482.8767 2142.6565 2971.1500 2987.8894 2997.2293 3015.6677 3040.1025 3050.2045 3065.9215 3132.5478 3430.6964
redmass: 4.4067 4.7392 2.0038 2.3895 5.6628 6.2970 3.0322 3.7659 5.4581 1.2296 1.2378 5.9311 1.0880 1.1651 1.3071 4.9038 4.7798 3.1317 1.3052 3.2052 1.1853 1.1940 1.3264 1.2441 1.1595 1.0520 1.3437 1.4879 1.0922 1.0918 1.0738 1.0986 6.0470 1.0583 1.0597 1.0589 1.0998 1.1030 1.0565 1.1051 1.1114 1.1586
irintensity: 2.4063 1.2147 0.1136 0.8027 3.1780 2.3493 7.3056 1.4415 17.5057 76.8237 76.7012 37.4059 10.8539 1.4951 0.6444 1.2029 6.5288 1.7620 0.1131 5.9695 0.2353 4.8211 0.0698 10.0799 2.0496 0.0183 24.9774 2.5476 4.2892 0.1548 0.0458 18.7597 9.5139 12.7668 5.1316 43.4105 3.2120 1.9839 27.8404 53.4176 26.1436 67.3519
temp: 298.150 k
press: 1.00000 atm
elementType: 17 6 6 6 6 6 6 1 1 1 1 1 1 1 1 1
symmnumber: 1
zpe: 342661.7 jmol-1
zpe.correction: 0.130513 hartree
zpe.thermalcorrener: 0.139343 hartree
zpe.thermalcorrenthalpy: 0.140287 hartree
zpe.thermalcorrgfe: 0.095701 hartree
zpe.sumelectzpe: -693.479783 hartree
zpe.sumelectthermal: -693.470953 hartree
zpe.sumelectthermalent: -693.470008 hartree
zpe.sumelectthermalfe: -693.514595 hartree
dipole: 1.6029 0.5713 0.0037
dipole: 1.7017
quadrupole: -60.6985 -48.4885 -49.7895
quadrupole: -0.0535 0.0206 0.0026
quadrupole: -7.7063 4.5036 3.2027 -0.0535 0.0206 0.0026
hfenergy: -693.6102955 hartree
pointgroup: C01 [X(C6H9Cl1)]
dipole: -0.6271848 -0.2341886 0.0031888 debye
dipolederiv: -0.7257004 -0.0644854 0.0004324 -0.1605673 -0.232035 0.0002951 0.0011932 0.0003082 -0.1899754 0.0192487 -0.0066281 0.0000371 0.0601418 0.0632792 0.0009042 -0.0005331 0.0011033 0.1868314 -0.2133201 0.024119 -0.0002484 -0.0152622 0.0011499 0.0011023 0.0000058 0.0009049 0.1389916 0.0488745 0.0184083 -0.000144 -0.0237655 0.12629 0.0003677 -0.0000607 0.0003212 0.1751696 0.8240154 0.1664306 -0.0012161 0.1253431 0.2572387 -0.0003439 -0.0009082 -0.0003178 0.2161889 0.1889845 0.1385996 -0.0007808 0.2456787 -0.0310274 -0.0000209 -0.0012633 0.0000998 -0.0711836 -0.5849341 -0.0222779 -0.0003741 -0.1191778 -0.3563568 -0.0002108 -0.0001697 -0.0004235 -0.345289 0.0573407 0.0003148 0.0059765 -0.0085865 -0.0196122 0.1066957 0.0079314 0.1223613 -0.0678049 0.0575625 0.0004504 -0.0058198 -0.0085624 -0.0235183 -0.1074393 -0.0075874 -0.1231364 -0.0639835 0.0613679 -0.0017674 -0.0005221 0.008217 -0.0118713 0.1047905 0.0104172 0.1126988 -0.0593616 0.0612726 -0.0018394 0.0005191 0.0080313 -0.0150422 -0.1054409 -0.0105588 -0.1133128 -0.0560861 0.0143508 -0.0522304 -0.0324514 -0.0210478 0.0038806 -0.0959454 -0.0226064 -0.1231391 -0.0268479 0.0144165 -0.0517971 0.0333767 -0.020841 0.0076159 0.0953684 0.0230694 0.1225016 -0.0305736 -0.023222 -0.0597006 0.0206577 -0.0204858 -0.0102991 0.0859967 -0.0099377 0.111572 -0.037764 -0.0232243 -0.0600193 -0.0198371 -0.020385 -0.0130924 -0.0863137 0.0101975 -0.1119077 -0.0349779 0.2229668 -0.0275772 0.0003942 -0.0287305 0.2534004 0.0001945 0.0008107 0.0003662 0.266666 unknown
polarizability: 109.917173|13.8738013|56.3835754|-0.0978501|-0.0750681|46.640398 unknown
InChI: InChI=1S/C6H9Cl/c1-2-3-4-5-6-7/h1H,3-6H2
charge 0 multiplicity 1
16 atoms
Cl 4.078681 0.21204 0.000077
C  -0.1242 -0.316935 0.00424
C  1.262141 0.373444 -0.000837
C  -1.27632 0.727625 -0.005413
C  2.392985 -0.654746 0.006406
C  -2.614979 0.111251 -0.001278
C  -3.73181 -0.412294 0.003097
H  -0.229645 -0.960648 0.898647
H  -0.228545 -0.9758 -0.879214
H  1.358318 1.018094 -0.895384
H  1.358428 1.031051 0.884209
H  -1.176116 1.391246 0.876672
H  -1.174891 1.3760 -0.898587
H  2.394054 -1.277709 0.914173
H  2.393823 -1.290423 -0.892506
H  -4.705824 -0.865396 0.009097
