program: Gaussian 09
title: 000272011
version: EM64L-G09RevD.01
frameworkgroup: C1[X(C16H20N2O2)]
method: RPBEPBE
basis: SDD
operation: Freq
keyword: #p
keyword: freq=noraman
keyword: PBEPBE/SDD
title: #p freq=noraman PBEPBE/SDD
converged: NO YES NO NO
title: Mulliken charges:
elementType: O O N N C C C C C C C C C C C C C C C C H H H H H H H H H H H H H H H H H H H H
charge: -0.213457 -0.212454 -0.078726 -0.348312 0.380099 -0.461002 -0.482581 -0.553261 -0.563097 -0.402937 -0.398646 0.128832 0.122735 -0.478373 0.449783 -0.447995 -0.379014 -0.220672 -0.228393 -0.245037 0.215380 0.212815 0.196378 0.218396 0.258619 0.246772 0.247569 0.259891 0.193185 0.242709 0.215887 0.185959 0.194585 0.220951 0.350193 0.232250 0.261912 0.225562 0.225254 0.228239
chargesum: 0.00000
title: Mulliken charges with hydrogens summed into heavy atoms:
elementType: O O N N C C C C C C C C C C C C C C C C
charge: -0.213457 -0.212454 -0.078726 0.001881 0.380099 -0.032807 -0.067807 -0.047870 -0.055637 0.032957 0.003200 0.128832 0.122735 -0.062837 0.449783 -0.215745 -0.117102 0.004890 -0.003139 -0.016798
polarizability: 2.10217550e+02 8.57819363e-01 1.83865394e+02 -1.65296330e+01 1.13882427e+01 1.52689393e+02
1716.lowfreq: -0.0006 -0.0005 0.0004 1.8211 6.3950 16.7090 29.3584 34.6614 38.5526
frequency: 29.1020 34.6521 38.5231 70.5602 79.1223 106.3853 151.1665 188.7519 198.2873 210.7010 236.5236 280.6074 307.1801 326.3218 339.2934 357.2786 377.9362 406.4184 408.7332 441.1776 458.4129 481.8161 497.3218 534.4743 543.2838 578.5765 587.7000 599.9318 617.0764 644.8403 705.4231 737.1832 759.8778 784.8050 802.8341 806.6106 814.6765 842.8216 860.8782 891.9264 911.5170 914.9068 918.9684 946.4791 978.9303 983.7388 990.0045 992.1906 998.3710 1010.5194 1022.7246 1026.5485 1040.5925 1077.1305 1091.7422 1117.0832 1129.1472 1140.8333 1150.1563 1170.2091 1180.2679 1181.8350 1192.4713 1207.6890 1213.9861 1251.0328 1258.1968 1274.2222 1282.0871 1290.0180 1304.2435 1313.7890 1324.7016 1328.9722 1334.8608 1341.2342 1356.8130 1363.9671 1370.3702 1381.7377 1398.0166 1433.0661 1440.5735 1444.2805 1448.6000 1459.5380 1460.3924 1477.0471 1482.6806 1486.6548 1594.5453 1614.9722 1637.9610 1641.7255 2830.9186 2837.2952 2853.3239 2970.5730 2972.5501 2976.0834 2985.2480 2986.0756 3021.7024 3035.2523 3042.4215 3045.4602 3068.1388 3084.3887 3112.4989 3122.8261 3135.9613 3147.0012 3161.7937 3483.4209
redmass: 5.1836 4.7106 5.4833 4.5147 4.4769 3.9883 7.0371 3.1190 3.8422 4.3954 2.8171 2.2160 2.1726 2.4043 3.7399 3.7685 2.2451 2.8507 2.8125 3.1906 3.1881 3.5680 3.6914 2.8556 3.5970 5.0952 3.3864 4.5742 6.3249 2.3141 2.2284 1.7402 2.4905 2.4468 1.3229 3.4508 1.8450 4.1667 1.2475 2.1181 2.1480 1.6060 2.6463 2.0105 2.1571 1.4038 5.7609 2.0122 1.3957 1.8427 1.7254 2.0623 2.6543 1.6053 2.0729 2.3155 2.9204 1.6313 2.0384 1.0641 1.1138 1.0928 1.7587 1.3558 1.8953 1.7745 2.4672 1.5675 1.5197 1.4957 1.7091 1.5037 2.9438 1.4221 1.5629 1.4672 1.5240 1.4632 1.8547 3.6737 1.7511 1.0850 2.0311 1.1003 1.0847 1.0923 1.1240 1.1002 2.0156 1.1333 6.1565 6.1418 9.3177 6.0328 1.0717 1.0716 1.0697 1.0650 1.0636 1.0658 1.0638 1.0831 1.0868 1.1020 1.0938 1.0953 1.0934 1.0908 1.0873 1.0861 1.0912 1.0956 1.1014 1.0760
irintensity: 0.0950 0.1265 0.2469 0.4908 3.1160 2.5479 4.9845 2.4594 3.2068 0.7657 1.7925 0.2276 0.7826 1.8786 17.9325 1.8747 0.5713 0.3749 8.9760 8.3164 8.8823 2.0097 7.4509 3.6376 10.7135 1.7132 8.0051 2.1150 0.0822 0.2593 32.1481 46.5703 32.0514 8.2526 77.0072 4.2727 24.5102 8.5169 0.3061 0.1213 0.5060 9.9664 9.6875 3.8694 21.0623 0.5120 0.7653 9.4051 2.0407 7.1769 2.2817 11.6832 2.1276 14.3007 7.6465 30.5838 2.8364 54.6678 7.8645 0.6232 3.9801 5.6369 17.9574 1.3554 5.8175 11.0675 132.0780 44.6350 95.8065 7.5316 18.7772 35.4917 59.0031 1.2989 23.7488 9.1936 12.8863 3.0190 11.6901 4.5349 2.6796 2.7723 10.3814 4.5348 20.9075 10.8290 11.2520 1.0563 11.1434 12.1025 1.0325 6.7719 192.3821 404.8054 42.8224 50.4417 172.7186 1.3662 26.2875 38.9275 30.4010 11.2242 50.9035 29.1512 20.8360 33.8766 13.4906 7.9352 8.9441 0.0842 16.4270 33.8539 26.4329 37.1478
temp: 298.150 k
press: 1.00000 atm
elementType: 8 8 7 7 6 6 6 6 6 6 6 6 6 6 6 6 6 6 6 6 1 1 1 1 1 1 1 1 1 1 1 1 1 1 1 1 1 1 1 1
symmnumber: 1
zpe: 875645.3 jmol-1
zpe.correction: 0.333516 hartree
zpe.thermalcorrener: 0.350952 hartree
zpe.thermalcorrenthalpy: 0.351897 hartree
zpe.thermalcorrgfe: 0.287052 hartree
zpe.sumelectzpe: -880.192633 hartree
zpe.sumelectthermal: -880.175196 hartree
zpe.sumelectthermalent: -880.174252 hartree
zpe.sumelectthermalfe: -880.239097 hartree
dipole: 2.4406 -1.4887 2.6219
dipole: 3.8790
quadrupole: -131.0550 -125.8289 -119.6768
quadrupole: 5.7300 -12.6522 -5.9637
quadrupole: -5.5348 -0.3087 5.8434 5.7300 -12.6522 -5.9637
hfenergy: -880.5261483 hartree
pointgroup: C01 [X(C16H20N2O2)]
dipole: -0.9815263 1.0741993 -0.4601958 debye
polarizability: 208.8642803|18.2702141|151.2138396|2.2688504|6.9543219|186.6942181 unknown
InChI: InChI=1S/C16H20N2O2/c19-14-10-16(11-15(20)17-14)6-8-18(9-7-16)12-13-4-2-1-3-5-13/h1-5,17H,6-12H2
charge 0 multiplicity 1
40 atoms
O  4.545282 -0.358645 2.577239
O  3.964604 -1.62374 -1.840213
N  -0.957592 0.94552 -0.467896
N  4.22354 -0.926168 0.353839
C  1.961363 0.81616 0.149527
C  0.934361 -0.264631 0.607272
C  1.187672 2.143046 -0.095493
C  3.02329 1.055511 1.256715
C  2.715419 0.376729 -1.138207
C  -0.286844 -0.369181 -0.326762
C  -0.037031 1.967146 -1.015712
C  3.975383 -0.111759 1.482402
C  3.659476 -0.802445 -0.935761
C  -2.229295 0.861973 -1.224577
C  -3.328517 0.112433 -0.476375
C  -4.235811 -0.719323 -1.177061
C  -3.490643 0.276979 0.922749
C  -5.292493 -1.368931 -0.497683
C  -4.541405 -0.374482 1.605074
C  -5.449028 -1.197961 0.896842
H  0.571372 0.005216 1.617888
H  1.418006 -1.257747 0.687209
H  1.868008 2.905121 -0.526366
H  0.830063 2.527816 0.879737
H  2.549597 1.281263 2.227835
H  3.643587 1.938189 0.993001
H  3.324654 1.224862 -1.515691
H  2.030449 0.097606 -1.954728
H  0.017708 -0.776767 -1.326536
H  -1.010944 -1.085583 0.099579
H  -0.580876 2.927992 -1.08558
H  0.297678 1.708807 -2.055239
H  -2.087854 0.394197 -2.232836
H  -2.564284 1.90341 -1.407705
H  4.872885 -1.710983 0.492951
H  -4.114648 -0.862173 -2.258585
H  -2.775102 0.909461 1.460212
H  -5.986382 -2.009963 -1.053379
H  -4.654986 -0.240742 2.687178
H  -6.264959 -1.702912 1.426237
