program: Gaussian 09
title: 000272008
version: EM64L-G09RevD.01
frameworkgroup: C1[X(C14H16N2O4)]
method: RPBEPBE
basis: SDD
operation: Freq
keyword: #p
keyword: freq=noraman
keyword: PBEPBE/SDD
title: #p freq=noraman PBEPBE/SDD
converged: YES YES NO NO
title: Mulliken charges:
elementType: O O O O N N C C C C C C C C C C C C C C H H H H H H H H H H H H H H H H
charge: -0.231198 -0.203724 -0.198926 -0.261264 -0.281907 -0.356448 0.161466 -0.398111 -0.396195 -0.435575 -0.436832 0.144564 0.212255 0.464173 -0.346689 -0.331502 -0.350924 -0.352736 0.328826 -0.537669 0.245136 0.208618 0.210468 0.244651 0.224946 0.219224 0.219218 0.228637 0.272056 0.268329 0.272810 0.244517 0.255900 0.223209 0.222985 0.247716
chargesum: 0.00000
title: Mulliken charges with hydrogens summed into heavy atoms:
elementType: O O O O N N C C C C C C C C C C C C C C
charge: -0.231198 -0.203724 -0.198926 -0.261264 -0.009851 -0.356448 0.161466 0.055642 0.058923 0.008596 0.011023 0.144564 0.212255 0.464173 -0.078361 -0.058693 -0.106408 -0.096836 0.328826 0.156241
polarizability: 2.58803573e+02 -2.34544534e+00 1.66842327e+02 -1.56606283e+00 8.98562313e+00 1.16067996e+02
1716.lowfreq: -3.6305 -0.0008 -0.0004 0.0004 4.4044 9.4586 28.4866 37.9202 55.2489
frequency: 28.4468 37.8161 55.2455 80.0556 94.2174 121.3344 139.8287 159.6648 195.1280 209.9417 232.9155 247.1347 272.0371 285.7626 302.7315 345.2569 361.8268 364.9776 407.9565 413.3967 423.2851 455.7382 475.4621 502.6581 520.6587 563.3273 585.7323 624.2217 630.5156 659.1810 678.0911 711.6813 725.3336 730.3399 760.8891 802.3710 811.5954 815.6337 831.1861 865.3968 920.0983 921.1467 933.2356 951.8652 956.6545 978.2080 987.3416 1004.5458 1032.0191 1040.1583 1057.0644 1087.8871 1112.9772 1120.5107 1127.7635 1143.1479 1158.8208 1166.9550 1167.5985 1180.9961 1188.2626 1232.1898 1236.6992 1279.5932 1306.2000 1309.7039 1310.9013 1329.1800 1329.8547 1343.6837 1380.9776 1394.9867 1428.9416 1437.9897 1443.2318 1445.2893 1460.5390 1468.2444 1470.7528 1472.4001 1481.7498 1504.0932 1585.1038 1625.4736 1637.0692 1723.1875 2910.0760 2915.2094 2961.9046 3008.8725 3010.9546 3041.5441 3045.2695 3050.7420 3077.3452 3080.9236 3127.8757 3162.4519 3166.0343 3188.3821 3191.4363 3467.6163
redmass: 5.0021 3.8348 4.9469 5.2584 4.3016 4.3853 4.8850 4.8290 2.6054 4.6185 2.4717 1.6432 2.1953 5.3737 5.2133 3.3188 3.9409 3.8657 5.1515 3.3321 5.7640 3.4161 3.5082 1.7631 2.5474 4.5256 4.5875 9.4146 7.0899 2.4425 10.1326 4.0345 4.5233 4.9975 5.5807 1.3930 3.6173 1.4775 1.7069 2.9891 2.2759 4.7972 1.4223 3.3845 1.3941 3.6886 8.8009 2.6756 1.5932 2.7172 1.8454 5.6238 1.2596 2.9088 1.4339 2.6707 1.3428 2.4900 3.1916 1.1161 1.4011 1.5292 2.8719 1.3258 1.8883 1.2967 1.3147 1.5164 1.3383 3.7647 6.7308 1.3778 3.5977 1.1767 1.3151 1.0908 1.1026 1.0499 1.0708 1.0782 1.1002 2.4464 7.4014 6.3487 11.1823 12.8037 1.0701 1.0694 1.0329 1.0601 1.0610 1.0901 1.0915 1.1041 1.1041 1.1038 1.0995 1.0887 1.0894 1.0954 1.0966 1.0754
irintensity: 0.3755 0.9271 0.7265 0.1493 1.2003 4.8767 3.5368 4.1473 2.3157 5.2197 1.8934 0.8123 1.0443 2.9492 2.6933 1.2607 4.0390 3.8431 10.8462 8.8133 16.9612 1.3726 24.4106 82.6409 17.7989 39.2632 27.5307 6.6983 1.2639 51.7680 5.5560 3.5670 14.7102 5.6959 4.6165 14.3065 8.1702 1.6288 62.6789 5.9742 2.4191 67.5885 8.6882 37.5811 1.7416 30.3854 40.1253 2.9560 0.7545 80.5810 5.0693 97.7156 0.1525 1.4243 40.5196 79.4019 0.2432 147.9846 22.8115 0.7837 42.6218 0.1116 244.7263 6.5882 11.0033 4.7870 3.7590 43.6167 31.1229 154.2465 7.6550 0.4890 2.5666 21.1324 4.8315 7.6256 7.2804 14.1121 2.3147 67.7721 30.3073 233.3249 20.5097 45.5673 393.9374 233.9231 56.1373 60.9818 66.5720 14.3370 13.9045 56.8601 33.0361 46.7526 9.6218 29.0489 24.5411 10.9092 4.1128 1.9485 0.2268 0.1475
temp: 298.150 k
press: 1.00000 atm
elementType: 8 8 8 8 7 7 6 6 6 6 6 6 6 6 6 6 6 6 6 6 1 1 1 1 1 1 1 1 1 1 1 1 1 1 1 1
symmnumber: 1
zpe: 746535.0 jmol-1
zpe.correction: 0.284340 hartree
zpe.thermalcorrener: 0.302040 hartree
zpe.thermalcorrenthalpy: 0.302984 hartree
zpe.thermalcorrgfe: 0.238146 hartree
zpe.sumelectzpe: -952.015942 hartree
zpe.sumelectthermal: -951.998242 hartree
zpe.sumelectthermalent: -951.997298 hartree
zpe.sumelectthermalfe: -952.062136 hartree
dipole: -0.0413 -4.6674 -0.0404
dipole: 4.6678
quadrupole: -96.1503 -124.4498 -113.3360
quadrupole: 3.0185 4.2170 8.1594
quadrupole: 15.1618 -13.1377 -2.0240 3.0185 4.2170 8.1594
hfenergy: -952.3002818 hartree
pointgroup: C01 [X(C14H16N2O4)]
dipole: 0.0035095 1.8361234 0.0343228 debye
polarizability: 258.8017194|1.2363417|166.6173681|2.9704884|9.485694|116.2948085 unknown
InChI: InChI=1S/C14H16N2O4/c1-19-11-4-2-10(3-5-11)16-12(17)14(20-13(16)18)6-8-15-9-7-14/h2-5,15H,6-9H2,1H3
charge 0 multiplicity 1
36 atoms
O  2.078345 -1.774663 0.353965
O  1.032845 1.630583 -0.245818
O  0.05627 -2.918811 0.537231
O  -5.413984 0.455644 -0.306228
N  4.859254 1.353076 -0.113795
N  0.146067 -0.555279 0.115699
C  2.511932 -0.347483 0.123035
C  3.324463 0.1068 1.358059
C  3.37462 -0.31391 -1.159444
C  4.02288 1.462638 1.101637
C  4.070527 1.056412 -1.330355
C  1.178512 0.40235 -0.030848
C  0.681504 -1.865847 0.356932
C  -1.268807 -0.278606 0.030524
C  -1.777309 0.947182 0.515859
C  -2.147249 -1.227656 -0.554354
C  -3.155396 1.233557 0.418934
C  -3.519858 -0.948479 -0.642201
C  -4.031981 0.282637 -0.159815
C  -5.997363 1.709565 0.17882
H  4.091511 -0.666796 1.541596
H  2.671136 0.166891 2.247872
H  2.75657 -0.549467 -2.045046
H  4.14335 -1.09993 -1.05135
H  3.251582 2.264533 1.027533
H  4.674114 1.694495 1.96368
H  4.756065 1.000584 -2.195088
H  3.301138 1.832655 -1.549574
H  5.484865 2.158269 -0.235994
H  -1.102005 1.686644 0.95161
H  -1.764043 -2.183911 -0.917245
H  -3.52515 2.190696 0.796992
H  -4.214066 -1.669714 -1.082709
H  -5.573874 2.582679 -0.354514
H  -5.844803 1.828633 1.269068
H  -7.072256 1.628128 -0.038368
