program: Gaussian 09
title: 000272010
version: EM64L-G09RevD.01
frameworkgroup: C1[X(C15H21NO3)]
method: RPBEPBE
basis: SDD
operation: Freq
keyword: #p
keyword: freq=noraman
keyword: PBEPBE/SDD
title: #p freq=noraman PBEPBE/SDD
converged: YES YES NO NO
title: Mulliken charges:
elementType: O O O N C C C C C C C C C C C C C C C H H H H H H H H H H H H H H H H H H H H H
charge: -0.483365 -0.255949 -0.263354 -0.087775 0.206432 -0.459090 -0.449261 -0.372121 -0.374040 -0.482031 0.162779 0.448828 -0.378327 -0.449014 -0.254562 -0.229700 -0.221580 -0.246988 -0.662543 0.206377 0.230414 0.229132 0.206113 0.228055 0.218096 0.210703 0.205753 0.220371 0.195002 0.365322 0.264655 0.232287 0.227121 0.237690 0.222636 0.223289 0.225706 0.221779 0.250443 0.230717
chargesum: 0.00000
title: Mulliken charges with hydrogens summed into heavy atoms:
elementType: O O O N C C C C C C C C C C C C C C C
charge: -0.118043 -0.255949 -0.263354 -0.087775 0.206432 -0.022299 -0.014016 0.074030 0.042416 -0.066658 0.162779 0.448828 -0.113671 -0.216727 0.210249 -0.007064 0.001709 -0.021282 0.040396
polarizability: 2.16647007e+02 -4.53778946e+00 1.74834846e+02 1.58449632e+01 8.07715378e+00 1.29798095e+02
1716.lowfreq: -9.6030 -5.6893 -0.0005 -0.0001 0.0005 4.0609 13.5592 26.4748 30.7969
frequency: 8.8906 26.4543 30.7775 52.3588 64.1306 69.8998 90.8509 154.6297 164.9421 187.3540 204.7153 216.5276 246.1622 277.6739 304.2707 320.5374 339.9463 347.4384 358.6086 384.3458 403.7776 406.3274 431.2826 464.9027 488.6493 495.6066 565.6415 599.7829 617.2721 680.4630 701.6630 705.7023 731.3079 740.4115 779.2287 805.0757 808.2899 813.7110 818.0655 860.6982 912.8612 934.1076 942.0431 947.0238 982.7432 989.5400 995.8381 996.7738 1009.6241 1014.8850 1019.4762 1026.4380 1052.0856 1076.0466 1095.6976 1107.7517 1121.4565 1132.0966 1152.5573 1157.7250 1169.0078 1179.4947 1189.6655 1193.4011 1209.9197 1228.1206 1260.3715 1274.1992 1276.8699 1287.4874 1313.3001 1321.5648 1326.2633 1340.2085 1354.1870 1360.1798 1369.7819 1381.1806 1391.6993 1396.0263 1433.6581 1439.9396 1446.6867 1456.7442 1459.5349 1464.1755 1466.9554 1480.9576 1483.4627 1484.2586 1594.1335 1597.2784 1614.6129 2846.2284 2886.7796 2892.3284 2983.6104 2994.5282 3005.5696 3008.2668 3024.9384 3033.7133 3045.5029 3074.0299 3079.9044 3089.9214 3096.8640 3112.0782 3121.3352 3123.5310 3134.8865 3146.2359 3160.5446 3448.1069
redmass: 3.8724 4.4744 3.9837 4.4322 4.2674 3.3097 3.8284 3.9060 3.4303 3.4044 2.5254 1.7261 2.6032 2.6266 2.4944 2.2794 1.4217 3.3985 3.5940 2.8683 2.2556 2.8222 2.6064 2.9988 3.5596 2.9697 3.7633 4.3195 6.3535 3.0819 6.4909 2.2673 3.2626 1.6034 2.7481 1.6439 3.0463 1.4885 3.5255 1.2482 1.4312 2.7415 2.1066 2.4374 1.3827 5.3751 1.5176 2.3067 2.0067 1.6545 2.7940 2.1013 2.2681 1.6095 2.1952 2.4673 3.2491 2.9536 2.3857 1.6898 1.0624 1.1118 2.6457 1.1812 2.3998 1.3750 1.3791 1.2771 1.2327 1.5119 1.3636 1.3647 1.2885 1.3415 1.3068 1.4225 1.7706 3.1080 1.2336 1.8190 1.0920 2.1040 1.0924 1.1054 1.1027 1.0432 1.1073 1.5073 1.0566 1.4149 6.1747 8.7185 6.1455 1.0707 1.0701 1.0687 1.0863 1.0361 1.0606 1.0634 1.0854 1.0597 1.0896 1.1034 1.1032 1.0973 1.1029 1.0867 1.0863 1.1068 1.0915 1.0954 1.1014 1.0650
irintensity: 0.9793 0.2677 0.4258 0.8935 0.4227 0.8787 2.0918 0.5632 0.1082 5.5338 3.0559 1.7054 1.1269 1.4486 6.3857 7.9230 85.5137 29.2447 7.1481 9.5417 6.9105 1.1024 1.2753 12.3952 2.2490 0.2341 1.9459 4.7206 0.1018 5.2821 6.3938 39.7694 4.1484 57.3356 23.0824 0.6407 5.8668 1.8853 10.6070 0.2359 9.8648 23.5893 5.7807 21.2801 0.4988 0.2629 7.5019 14.7103 28.4499 11.8604 58.9293 9.4205 50.1656 21.9704 43.8868 101.5279 2.4106 104.7314 5.9667 9.3338 0.5858 1.5717 251.4835 7.5158 3.9928 15.0551 9.6383 4.9371 4.2913 25.6835 14.4094 0.5131 3.6275 16.7975 3.8757 3.5373 29.2317 6.9071 24.7387 0.2955 5.5718 12.7380 15.3184 18.1876 5.2733 16.0920 7.3997 11.1810 12.2853 14.4343 1.4658 159.0873 7.0329 67.9920 42.2869 106.4474 22.1100 14.9024 13.1154 24.1225 50.3867 29.1805 21.7976 11.7448 33.1849 35.0793 1.3286 8.3708 0.3205 25.9191 20.6114 33.5982 28.6249 55.8983
temp: 298.150 k
press: 1.00000 atm
elementType: 8 8 8 7 6 6 6 6 6 6 6 6 6 6 6 6 6 6 6 1 1 1 1 1 1 1 1 1 1 1 1 1 1 1 1 1 1 1 1 1
symmnumber: 1
zpe: 879191.7 jmol-1
zpe.correction: 0.334866 hartree
zpe.thermalcorrener: 0.353715 hartree
zpe.thermalcorrenthalpy: 0.354659 hartree
zpe.thermalcorrgfe: 0.284779 hartree
zpe.sumelectzpe: -863.159545 hartree
zpe.sumelectthermal: -863.140696 hartree
zpe.sumelectthermalent: -863.139752 hartree
zpe.sumelectthermalfe: -863.209632 hartree
dipole: 1.2345 2.1368 0.9844
dipole: 2.6569
quadrupole: -105.0430 -108.1064 -113.5627
quadrupole: 11.7560 8.3719 -1.5549
quadrupole: 3.8610 0.7976 -4.6587 11.7560 8.3719 -1.5549
hfenergy: -863.494411 hartree
pointgroup: C01 [X(C15H21N1O3)]
dipole: -0.4193467 0.8800148 -0.3773314 debye
polarizability: 216.7987854|1.2713301|174.6753646|16.03228|-8.4982915|129.8057971 unknown
InChI: InChI=1S/C15H21NO3/c1-2-19-14(17)15(18)8-10-16(11-9-15)12-13-6-4-3-5-7-13/h3-7,18H,2,8-12H2,1H3
charge 0 multiplicity 1
40 atoms
O  -2.31314 -1.920595 0.88957
O  -3.386692 1.222297 -0.679073
O  -4.48334 -0.348744 0.649953
N  0.75656 -0.88364 -0.545126
C  -2.104836 -0.684649 0.120351
C  -1.025536 0.178506 0.832195
C  -1.608624 -1.064127 -1.300706
C  0.324489 -0.559602 0.840615
C  -0.237389 -1.759565 -1.218579
C  2.121592 -1.459484 -0.583685
C  -3.445499 0.063794 0.066062
C  3.210912 -0.447387 -0.238163
C  3.122063 0.891216 -0.697929
C  4.351811 -0.840779 0.5034
C  -4.64004 2.046592 -0.754758
C  4.156126 1.813843 -0.426952
C  5.391302 0.079565 0.773218
C  5.297204 1.41102 0.307513
C  -4.73546 2.987397 0.448046
H  -1.346916 0.378939 1.87097
H  -0.921872 1.139916 0.2981
H  -1.524794 -0.146333 -1.909348
H  -2.343288 -1.741868 -1.772879
H  1.092788 0.083464 1.305482
H  0.228834 -1.485677 1.458802
H  -0.357641 -2.732817 -0.682539
H  0.123193 -1.976053 -2.2420
H  2.288617 -1.826461 -1.617192
H  2.221511 -2.350845 0.087795
H  -3.25862 -1.912148 1.208649
H  2.227101 1.19072 -1.254826
H  4.426415 -1.871313 0.87379
H  -4.526843 2.591709 -1.704875
H  -5.503772 1.361012 -0.80401
H  4.074947 2.845994 -0.787667
H  6.26756 -0.239733 1.349202
H  6.100088 2.126888 0.517693
H  -5.614248 3.64847 0.332219
H  -4.856363 2.417372 1.384283
H  -3.835401 3.621105 0.525596
