program: Gaussian 09
title: 000272037
version: EM64L-G09RevD.01
frameworkgroup: C1[X(C10H11Cl2N5O4)]
method: RPBEPBE
basis: SDD
operation: Freq
keyword: #p
keyword: freq=noraman
keyword: PBEPBE/SDD
title: #p freq=noraman PBEPBE/SDD
converged: YES YES NO NO
title: Mulliken charges:
elementType: Cl Cl O O O O N N N N N C C C C C C C C C C H H H H H H H H H H H
charge: 0.051475 0.032971 -0.261812 -0.447980 -0.467344 -0.487123 -0.165461 0.067854 -0.274974 0.033951 -0.596594 -0.159557 -0.071702 -0.217306 -0.026513 -0.326909 0.319974 -0.175277 0.132662 -0.326857 0.048754 0.272798 0.269941 0.258547 0.228844 0.240431 0.197099 0.354058 0.403479 0.365007 0.392202 0.335365
chargesum: 0.00000
title: Mulliken charges with hydrogens summed into heavy atoms:
elementType: Cl Cl O O O O N N N N N C C C C C C C C C C
charge: 0.051475 0.032971 -0.261812 -0.093922 -0.063866 -0.122116 -0.165461 0.067854 -0.274974 0.033951 0.130973 0.113241 0.198238 0.041241 0.202331 0.110621 0.319974 -0.175277 0.132662 -0.326857 0.048754
polarizability: 2.20557202e+02 7.58955665e+00 2.20830815e+02 -2.81449767e-02 2.15507908e+00 9.70554804e+01
1716.lowfreq: -8.0849 -6.8183 -0.0016 -0.0008 0.0009 6.4525 41.1069 54.9463 72.4125
frequency: 41.0746 54.9326 72.4107 96.4430 127.5601 138.1259 139.2876 152.1439 152.9522 203.2075 207.6967 242.7053 251.0862 278.8853 285.9746 289.6501 305.5456 325.1140 360.6791 374.4816 377.5149 396.9905 435.0898 453.8690 480.4628 536.1335 557.9636 587.3813 605.2637 610.5807 640.6808 648.3854 671.0862 706.6071 718.6043 753.0952 773.2637 784.5798 800.5228 804.0480 838.1401 852.5704 888.4883 905.9277 926.3605 960.6134 986.3789 1000.0200 1016.3996 1025.2815 1048.0738 1079.2009 1090.4145 1113.9705 1158.0041 1171.8143 1186.8278 1202.9863 1228.5601 1243.7792 1256.9242 1268.0870 1290.3950 1298.7649 1317.2484 1320.4059 1335.3846 1352.2644 1363.2495 1381.4899 1412.6481 1424.7434 1455.8149 1457.8927 1515.0649 1527.0852 1573.3993 1613.1503 1630.2226 2318.7043 2963.7642 2990.6801 3028.8466 3048.6927 3055.6307 3072.0938 3190.4143 3335.5373 3581.8923 3646.9054
redmass: 8.2659 8.8277 6.0868 5.9936 6.7171 12.7094 9.6958 9.7118 4.9146 8.5413 8.0851 7.3359 5.3735 4.1241 4.0037 3.0334 2.5598 2.4966 9.2232 9.1693 12.6851 8.9289 5.0551 5.0892 7.2669 8.3148 1.2583 5.4322 6.1325 4.2658 4.3691 9.9384 1.4182 7.9906 6.4855 4.8620 5.6739 5.5361 1.5387 5.4666 6.2252 2.8004 9.2899 3.5996 4.2612 2.6777 6.1076 4.7632 2.5021 3.0742 4.0810 2.6458 2.7217 3.4529 1.3625 1.2636 1.6238 2.6628 1.3041 4.7415 1.4011 1.1792 1.3981 1.2730 2.6356 1.5475 1.5736 5.7266 1.2783 1.7549 4.3963 6.1003 1.1212 1.1054 2.6175 7.9224 1.5541 1.9332 2.2387 1.0895 1.0699 1.0827 1.0872 1.0852 1.0883 1.0953 1.0676 1.0622 1.0666 1.0907
irintensity: 1.4678 0.3712 2.9606 0.9529 1.7800 3.2141 1.2982 4.8357 3.5432 1.1985 2.8710 2.4365 8.0676 44.6993 13.1960 16.0345 25.4284 107.5949 9.4048 2.3737 11.4043 2.9578 4.9400 15.5829 0.2781 1.7933 108.0597 25.1074 40.5487 49.1210 31.8797 8.5297 295.2213 4.8773 22.0719 13.2667 18.1310 21.9726 71.5064 53.0903 29.9357 32.5563 156.4083 18.0973 33.3141 58.3265 41.2749 57.0607 77.8033 29.1818 82.8691 29.4400 19.1791 94.8041 19.3140 86.3519 83.5195 93.7182 5.6479 19.8570 0.4114 11.0570 1.1997 2.6650 15.4332 12.4026 18.1176 40.2439 6.0380 56.3227 34.3438 157.8688 25.1980 6.0308 118.9452 368.8752 25.7623 48.0844 684.8780 1868.3402 39.9546 89.1864 23.3007 2.2892 30.0918 23.8691 198.6443 451.0487 15.2942 127.6884
temp: 298.150 k
press: 1.00000 atm
elementType: 17 17 8 8 8 8 7 7 7 7 7 6 6 6 6 6 6 6 6 6 6 1 1 1 1 1 1 1 1 1 1 1
symmnumber: 1
zpe: 588522.6 jmol-1
zpe.correction: 0.224156 hartree
zpe.thermalcorrener: 0.242527 hartree
zpe.thermalcorrenthalpy: 0.243471 hartree
zpe.thermalcorrgfe: 0.177889 hartree
zpe.sumelectzpe: -1880.855351 hartree
zpe.sumelectthermal: -1880.836980 hartree
zpe.sumelectthermalent: -1880.836036 hartree
zpe.sumelectthermalfe: -1880.901618 hartree
dipole: 5.5324 -0.4893 -1.0699
dipole: 5.6561
quadrupole: -134.9629 -135.6407 -135.2865
quadrupole: 7.8560 -3.4066 -5.8920
quadrupole: 0.3338 -0.3440 0.0102 7.8560 -3.4066 -5.8920
hfenergy: -1881.0795075 hartree
pointgroup: C01 [X(C10H11Cl2N5O4)]
dipole: -2.1982018 0.2245897 -0.263481 debye
polarizability: 220.0476649|5.5138453|216.4147783|-12.1350627|-21.7278215|101.9810538 unknown
InChI: InChI=1S/C10H11Cl2N5O4/c11-6-3-7(16-10(13)15-6)17(9(12)14-3)8-5(20)4(19)2(1-18)21-8/h2,4-5,8,18-20H,1,13H2
charge 0 multiplicity 1
32 atoms
Cl 0.64295 -3.900787 0.895668
Cl 4.902102 0.225062 -0.648399
O  -1.511138 -0.092781 1.336649
O  -3.382141 -2.146172 -0.274037
O  -2.045526 1.110383 -1.548295
O  -1.950801 3.03918 0.204391
N  0.125328 -1.29085 0.083825
N  2.365837 -1.875717 0.163234
N  0.372243 1.048428 -0.627928
N  2.691858 1.781514 -0.73857
N  0.888526 3.321261 -0.738389
C  -2.33351 -1.196923 -0.668129
C  -1.299256 -1.27357 0.492651
C  -2.840219 0.275377 -0.654177
C  -2.713592 0.663436 0.848066
C  -2.595202 2.168359 1.201258
C  0.85511 -0.164925 -0.296839
C  1.116741 -2.27434 0.35809
C  2.234701 -0.527128 -0.23422
C  3.124122 0.530946 -0.540544
C  1.331601 2.033311 -0.713498
H  -1.893248 -1.445377 -1.651988
H  -1.481608 -2.201519 1.063334
H  -3.884116 0.341396 -1.005833
H  -3.584279 0.250912 1.397975
H  -2.017748 2.26403 2.136526
H  -3.622631 2.545317 1.387016
H  -4.054797 -2.215275 -0.996733
H  -1.037975 1.112337 -1.200572
H  -2.177133 2.644791 -0.698136
H  -0.078392 3.49848 -0.419371
H  1.56739 4.072249 -0.840228
