program: Gaussian 09
title: 000271996
version: EM64L-G09RevD.01
frameworkgroup: C1[X(C8H10N2O4)]
method: RPBEPBE
basis: SDD
operation: Freq
keyword: #p
keyword: freq=noraman
keyword: PBEPBE/SDD
title: #p freq=noraman PBEPBE/SDD
converged: NO NO NO NO
title: Mulliken charges:
elementType: O O O O N N C C C C C C C C H H H H H H H H H H
charge: -0.230410 -0.213361 -0.202267 -0.215081 -0.381310 -0.375025 0.074192 -0.430827 -0.446854 -0.330585 -0.338682 0.174555 0.157774 0.155605 0.215926 0.263557 0.262832 0.217690 0.228001 0.218542 0.238056 0.220020 0.367775 0.369876
chargesum: 0.00000
title: Mulliken charges with hydrogens summed into heavy atoms:
elementType: O O O O N N C C C C C C C C
charge: -0.230410 -0.213361 -0.202267 -0.215081 -0.013535 -0.005148 0.074192 0.048656 0.033668 0.115958 0.119394 0.174555 0.157774 0.155605
polarizability: 1.35818700e+02 2.33080842e+00 1.04816717e+02 -7.73556812e+00 -5.05334367e-01 8.13657441e+01
1716.lowfreq: -7.6642 -5.5380 -0.0008 -0.0003 0.0004 9.1518 31.5620 116.7952 134.9566
frequency: 30.9990 116.7896 134.9481 150.1230 159.1167 207.7603 245.3657 278.3057 295.3575 352.0629 369.5461 389.9253 454.0458 469.3951 485.9312 551.7270 587.2826 651.7545 659.8115 675.5168 697.7836 706.6578 760.3675 787.0058 792.8214 804.7016 896.7833 924.7599 946.0396 991.2699 1009.0618 1025.1435 1031.4859 1068.7891 1113.5662 1136.1127 1186.3045 1193.0781 1235.7620 1273.3518 1280.8878 1300.7458 1324.5436 1347.9051 1349.1837 1361.0002 1375.2331 1378.7467 1379.5133 1441.9493 1455.9278 1459.9747 1468.1297 1613.4420 1649.7624 1683.1110 2969.4340 2993.4203 3004.8187 3011.4513 3063.1450 3075.3975 3077.1274 3092.7631 3517.4565 3520.5196
redmass: 9.4684 5.3430 6.4202 11.4873 3.2566 4.0922 3.2053 2.8186 4.0451 4.3949 2.7635 9.2934 3.6205 5.6452 8.4188 2.3553 6.4776 4.1416 2.4673 2.3137 5.6786 6.0926 1.8869 1.8775 2.6083 1.7981 3.2307 2.4921 3.0036 3.4211 2.2814 2.3223 2.3562 4.5764 4.1782 2.9675 1.5244 1.8339 1.2727 1.2737 1.6442 2.2439 1.5685 1.2416 1.3621 8.6968 1.3593 1.4162 1.9087 1.0868 1.0954 1.0783 1.0933 6.6942 8.2981 5.7775 1.0665 1.0597 1.0602 1.0627 1.1018 1.1003 1.0991 1.1051 1.0763 1.0777
irintensity: 0.3463 1.5823 0.7481 11.2555 0.2057 0.5019 5.0448 5.3344 8.9999 8.3854 25.8946 2.4383 10.2668 33.7143 13.8234 3.6777 2.6124 4.3163 6.8144 29.4422 2.6091 1.6613 3.7497 160.3717 53.8073 6.8333 18.9952 0.9161 19.3502 4.5385 4.9378 21.6533 12.2512 38.0547 20.0259 1.6106 28.5217 29.6020 16.7190 18.2413 57.9434 200.3024 70.9547 11.2960 45.8917 226.2299 2.5939 2.7002 13.9088 10.0820 11.8786 6.9918 21.1499 316.5058 117.9232 589.0139 38.7616 20.4067 10.2561 45.0523 17.7766 17.1793 10.9840 22.2317 79.2695 54.1781
temp: 298.150 k
press: 1.00000 atm
elementType: 8 8 8 8 7 7 6 6 6 6 6 6 6 6 1 1 1 1 1 1 1 1 1 1
symmnumber: 1
zpe: 484740.0 jmol-1
zpe.correction: 0.184628 hartree
zpe.thermalcorrener: 0.196493 hartree
zpe.thermalcorrenthalpy: 0.197437 hartree
zpe.thermalcorrgfe: 0.146454 hartree
zpe.sumelectzpe: -720.233651 hartree
zpe.sumelectthermal: -720.221786 hartree
zpe.sumelectthermalent: -720.220842 hartree
zpe.sumelectthermalfe: -720.271824 hartree
dipole: -0.7121 -0.5005 0.4142
dipole: 0.9639
quadrupole: -97.9699 -89.3251 -76.2798
quadrupole: -1.7451 -0.2505 -1.2745
quadrupole: -10.1116 -1.4668 11.5784 -1.7451 -0.2505 -1.2745
hfenergy: -720.4182788 hartree
pointgroup: C01 [X(C8H10N2O4)]
dipole: -0.2357569 0.1388496 -0.2626031 debye
dipolederiv: -0.5321121 -0.0768595 -0.00925 -0.064342 -0.3983565 -0.0311233 -0.0176899 -0.0398978 -0.7574191 -0.7205344 -0.1455269 -0.1578274 -0.3138784 -0.8783085 -0.1611809 -0.1709336 -0.0735259 -0.370453 -0.5707297 0.0068433 -0.0834877 0.0993459 -0.9402273 0.3204146 -0.129575 0.2315832 -0.4673429 -1.1854432 0.0667503 -0.3444301 0.0736627 -0.572263 0.072041 -0.3638004 0.0726216 -0.5235206 -1.3146698 -0.4781647 -0.3004438 -0.2598207 -0.6279835 -0.0561473 -0.3857451 -0.1562759 -0.4412918 -0.9823731 0.5179531 -0.3602489 0.2876396 -0.8594695 0.2498976 -0.3435813 0.359838 -0.5347932 -0.3614292 -0.0511823 0.0119323 -0.0295833 -0.2924926 0.0262596 0.1594735 0.0238266 -0.0469136 0.05055 -0.0874812 -0.0742697 -0.1526001 -0.0635517 0.0292836 -0.214827 0.0275933 0.1338803 0.0122497 -0.0449717 0.0722011 -0.1080806 -0.0171443 -0.0036287 0.0863489 0.0243354 0.1017782 0.3494637 0.0304027 0.1990767 0.0954213 0.329782 -0.0838542 0.2037314 0.0006955 0.4674103 0.3363174 -0.0114937 -0.1736311 0.0634191 0.3335659 0.0894697 -0.1196717 0.0402373 0.4893111 1.4083055 0.2302212 0.45339 -0.0300015 0.9835399 0.1375826 0.5430715 0.1777654 0.3425641 1.2846046 -0.2084555 0.3803084 0.1005013 1.0039609 -0.4193583 0.3342229 -0.4698729 0.501138 1.6983722 0.0794163 0.5310891 0.0845646 1.6193441 -0.2315408 0.6189016 -0.2446724 0.6302797 -0.0221526 -0.00191 -0.1275518 0.00597 0.0828074 0.0314222 -0.0723607 0.0111525 -0.0868649 0.0461174 0.0295015 0.0325729 0.0202173 -0.061906 -0.0009075 0.0345228 0.017845 0.0747049 0.0756067 0.0132453 -0.0126044 0.030865 -0.0381761 0.0474195 -0.0190292 0.0003518 0.0852376 -0.0041884 0.0340051 0.1056615 0.0279902 0.0657433 -0.082941 0.0524598 -0.0491191 -0.0646079 -0.0414093 0.0120433 0.091483 0.02513 0.0773604 -0.0552951 0.0671558 -0.0310915 -0.0834031 0.0511074 0.0483445 -0.0846723 0.0207176 -0.1374321 0.0838623 -0.0622555 -0.0094542 0.0192917 0.0887438 0.0386105 0.0802307 -0.0124222 -0.1221086 -0.056125 0.0547842 0.0330285 0.0259116 -0.0450644 0.0073639 -0.1051615 0.0452391 0.0847566 0.0488741 -0.0898261 0.0079072 -0.088486 0.1772602 -0.032178 -0.063695 -0.0511385 0.2177351 -0.0059721 -0.0823246 -0.0127986 0.3026286 0.2014075 0.0235227 -0.0606721 0.0411838 0.2108242 0.0515476 -0.0830523 0.0579268 0.2909601 unknown
polarizability: 130.1318416|2.0984127|103.0697379|18.3029371|-5.6065764|88.7995815 unknown
InChI: InChI=1S/C8H10N2O4/c11-5-8(1-3-14-4-2-8)6(12)10-7(13)9-5/h9-10H,1-4H2
charge 0 multiplicity 1
24 atoms
O  3.268341 -0.031487 0.238995
O  0.315707 2.275727 0.356168
O  -0.578803 -2.436247 0.89466
O  -3.613281 0.376363 -1.217923
N  -1.574005 1.271595 -0.500986
N  -2.031152 -1.023279 -0.211567
C  0.279491 -0.193846 0.334011
C  1.16169 -0.552191 -0.944995
C  1.186331 -0.263293 1.603412
C  2.477405 0.245317 -0.966167
C  2.549734 0.439378 1.439897
C  -0.302445 1.207145 0.106554
C  -0.793931 -1.300316 0.402221
C  -2.484795 0.217169 -0.695447
H  0.582945 -0.384189 -1.874278
H  1.40165 -1.629366 -0.875032
H  1.34627 -1.334525 1.816243
H  0.652303 0.176574 2.467053
H  3.104006 -0.086333 -1.810957
H  2.291717 1.335838 -1.06135
H  2.425647 1.536958 1.391998
H  3.209099 0.175644 2.282996
H  -1.912857 2.204611 -0.759236
H  -2.70357 -1.795448 -0.268371
