program: Gaussian 09
title: 000271994
version: EM64L-G09RevD.01
frameworkgroup: C1[X(C13H13FN2O3)]
method: RPBEPBE
basis: SDD
operation: Freq
keyword: #p
keyword: freq=noraman
keyword: PBEPBE/SDD
title: #p freq=noraman PBEPBE/SDD
converged: YES YES NO NO
title: Mulliken charges:
elementType: F O O O N N C C C C C C C C C C C C C H H H H H H H H H H H H H
charge: -0.201028 -0.227596 -0.199456 -0.199070 -0.282510 -0.357989 0.159815 -0.397481 -0.395565 -0.434821 -0.435840 0.148898 0.218967 0.469167 -0.306493 -0.317047 -0.369917 -0.367246 0.329413 0.246934 0.209404 0.210757 0.246352 0.224813 0.221503 0.221304 0.228260 0.274137 0.279369 0.280471 0.260647 0.261849
chargesum: 0.00000
title: Mulliken charges with hydrogens summed into heavy atoms:
elementType: F O O O N N C C C C C C C C C C C C C
charge: -0.201028 -0.227596 -0.199456 -0.199070 -0.008373 -0.357989 0.159815 0.058858 0.061543 0.011495 0.013724 0.148898 0.218967 0.469167 -0.027125 -0.036576 -0.109270 -0.105397 0.329413
polarizability: 2.23835728e+02 -6.98767688e+00 1.51822986e+02 -2.96019450e+00 9.46496503e+00 1.04729493e+02
1716.lowfreq: -3.5216 0.0005 0.0005 0.0007 3.1736 12.3899 30.4406 43.9215 64.4642
frequency: 30.2589 43.5689 64.4507 84.2351 107.5253 153.6127 162.4224 207.3407 225.3530 272.4830 286.7687 304.2481 319.4084 361.3624 364.1535 387.2259 411.3432 422.1658 430.1038 457.5141 494.6442 515.2951 558.1869 585.1571 622.6184 626.6537 654.7746 678.3383 704.5521 725.1451 728.5238 776.5324 806.0360 816.3816 819.3022 832.7653 865.8290 920.6976 921.4668 938.0245 950.1846 953.2155 981.1732 1006.4091 1034.5454 1039.8326 1056.6247 1081.8589 1120.0927 1123.7243 1143.5926 1161.3034 1167.0326 1168.4327 1180.3996 1210.1926 1232.0926 1278.6973 1302.6433 1305.9886 1308.7667 1328.2836 1328.8345 1342.0310 1381.0400 1393.6174 1416.4310 1442.2656 1449.4451 1465.0358 1474.0315 1485.8985 1498.3636 1602.0466 1615.3410 1640.5520 1722.4911 2911.6014 2914.0392 3009.0581 3010.7240 3042.7370 3046.3435 3077.5873 3080.7874 3174.1806 3174.3648 3196.7774 3201.0188 3469.4216
redmass: 5.1874 4.4108 6.9254 6.1274 5.6909 5.5415 5.3270 5.9951 5.1298 2.1615 5.7958 5.5188 7.4509 3.1504 3.4342 5.5589 2.9704 6.3203 5.2839 3.4373 1.6508 2.7021 5.5643 4.1284 10.0073 7.6046 2.4569 10.1856 4.0133 4.2897 5.8915 5.9310 1.2529 4.5543 1.4734 1.7155 3.0162 2.3677 4.5964 1.3782 1.3964 3.2554 3.8462 2.7875 1.5860 2.6918 1.8657 5.1660 2.9392 1.4197 2.6217 1.5685 3.0338 3.0976 1.1202 2.0850 1.5282 1.3216 1.2974 1.9029 1.2870 1.6063 1.2916 3.6379 9.1420 1.3796 3.3573 1.3225 1.0851 1.1021 1.0715 1.1023 2.5946 7.8841 6.3186 11.2054 12.7745 1.0703 1.0694 1.0601 1.0610 1.0901 1.0915 1.1040 1.1038 1.0902 1.0907 1.0960 1.0965 1.0754
irintensity: 0.4007 0.1956 0.9847 0.0627 1.9224 0.8485 5.4160 1.8844 1.5421 0.7861 4.5892 2.0343 3.1734 2.7495 4.1443 1.4732 0.4062 47.8595 0.4665 1.2751 94.4462 20.6707 50.1326 20.4941 4.3037 2.2621 45.2625 5.1861 2.0371 15.3220 4.3917 10.8248 0.4397 19.5992 2.4409 74.6010 6.1157 7.1126 59.5173 7.3687 1.6764 30.5508 28.3919 1.4803 0.7221 76.7665 4.5939 96.1260 1.4987 47.7033 57.8587 46.7257 108.1529 20.3302 0.5556 79.6533 0.1025 6.6430 8.3640 23.6418 5.3239 60.8219 26.7814 195.0900 0.6261 0.8660 4.9160 3.6904 9.6124 6.6176 2.2741 33.1214 243.4662 18.1106 6.5593 384.9683 226.8623 49.4916 68.4162 14.4816 13.7438 54.2773 29.5248 9.2554 26.5357 2.9697 1.5946 0.3944 0.3729 0.0457
temp: 298.150 k
press: 1.00000 atm
elementType: 9 8 8 8 7 7 6 6 6 6 6 6 6 6 6 6 6 6 6 1 1 1 1 1 1 1 1 1 1 1 1 1
symmnumber: 1
zpe: 642320.6 jmol-1
zpe.correction: 0.244647 hartree
zpe.thermalcorrener: 0.260515 hartree
zpe.thermalcorrenthalpy: 0.261459 hartree
zpe.thermalcorrgfe: 0.200725 hartree
zpe.sumelectzpe: -936.833915 hartree
zpe.sumelectthermal: -936.818047 hartree
zpe.sumelectthermalent: -936.817103 hartree
zpe.sumelectthermalfe: -936.877837 hartree
dipole: 3.1232 -2.4694 0.4154
dipole: 4.0031
quadrupole: -110.5199 -119.4888 -104.7020
quadrupole: -8.4808 -0.2063 7.5035
quadrupole: 1.0503 -7.9186 6.8682 -8.4808 -0.2063 7.5035
hfenergy: -937.0785619 hartree
pointgroup: C01 [X(C13H13F1N2O3)]
dipole: 1.2229929 -0.9839426 0.1286237 debye
polarizability: 223.5794531|-7.3697155|151.6615902|-4.9970783|10.2899916|105.1471632 unknown
InChI: InChI=1S/C13H13FN2O3/c14-9-1-3-10(4-2-9)16-11(17)13(19-12(16)18)5-7-15-8-6-13/h1-4,15H,5-8H2
charge 0 multiplicity 1
32 atoms
F  -5.654799 -1.008772 0.198072
O  1.62561 1.824267 -0.281967
O  0.808259 -1.659901 0.201908
O  -0.465729 2.841548 -0.419847
N  4.607052 -1.127568 0.077991
N  -0.221915 0.47391 -0.088619
C  2.153789 0.421145 -0.099889
C  2.990072 0.062922 -1.350349
C  3.019313 0.400938 1.180863
C  3.776974 -1.251964 -1.139649
C  3.805422 -0.925373 1.304698
C  0.873176 -0.41948 0.027511
C  0.228626 1.826355 -0.280038
C  -1.614413 0.10129 -0.019906
C  -2.026264 -1.160549 -0.51828
C  -2.558726 0.989871 0.553087
C  -3.382522 -1.537297 -0.442251
C  -3.917452 0.620696 0.621965
C  -4.299219 -0.636621 0.124947
H  3.704535 0.890605 -1.50816
H  2.340042 -0.010326 -2.241536
H  2.389473 0.564895 2.074297
H  3.734246 1.239134 1.099231
H  3.060185 -2.10475 -1.092293
H  4.4390 -1.411231 -2.009669
H  4.488669 -0.851963 2.169761
H  3.090606 -1.758129 1.500394
H  5.28988 -1.888753 0.171487
H  -1.295508 -1.849561 -0.945008
H  -2.244173 1.968278 0.921012
H  -3.723614 -2.506184 -0.816935
H  -4.665498 1.291769 1.052671
