program: Gaussian 09
title: 000271991
version: EM64L-G09RevD.01
frameworkgroup: C1[X(C13H16O3)]
method: RPBEPBE
basis: SDD
operation: Freq
keyword: #pfreq=noraman
keyword: PBEPBE/SDD
title: #p freq=noraman PBEPBE/SDD
converged: YES YES NO NO
title: Mulliken charges:
elementType: O O O C C C C C C C C C C C C C H H H H H H H H H H H H H H H H
charge: -0.488374 -0.307076 -0.229208 -0.050845 0.393632 -0.226701 0.215544 -0.393306 -0.378932 -0.145658 -0.448409 -0.221238 -0.238119 -0.242443 -0.670478 -0.493006 0.260056 0.277700 0.265873 0.268112 0.204035 0.208768 0.374871 0.225069 0.225431 0.227642 0.214128 0.213369 0.225728 0.248457 0.249424 0.235956
chargesum: 0.00000
title: Mulliken charges with hydrogens summed into heavy atoms:
elementType: O O O C C C C C C C C C C C C C
charge: -0.113503 -0.307076 -0.229208 -0.050845 0.393632 0.033356 0.215544 -0.115606 -0.113060 0.122454 -0.035606 0.003830 -0.012688 -0.014801 -0.017253 0.240831
polarizability: 1.60401429e+02 1.37629263e+01 1.53095750e+02 9.19838958e+00 -2.44745914e+00 1.34159647e+02
1716.lowfreq: -13.8085 -12.1793 -8.7394 -0.0010 -0.0009 -0.0009 23.9435 33.3734 34.2822
frequency: 23.8467 33.3260 34.2438 64.1312 69.0133 92.0070 106.7159 121.4968 165.3544 195.3237 209.7238 240.2277 257.1551 276.0398 298.3088 326.1557 337.8409 367.8374 388.0725 407.0560 426.4373 487.5270 539.2759 594.4020 614.7243 675.7743 700.7478 712.6995 753.3223 761.7558 786.6127 806.3402 863.5248 875.0295 896.1021 935.8537 944.3161 978.4078 986.7132 988.6623 991.2604 1001.4562 1019.8435 1027.7522 1066.4251 1076.4822 1102.0773 1115.4784 1133.4747 1146.4223 1158.6486 1166.9111 1171.9471 1190.1490 1233.9615 1265.1007 1290.3133 1312.7717 1314.3439 1338.8452 1380.2041 1386.6918 1421.8137 1432.7961 1452.1457 1463.4157 1464.6723 1474.0245 1474.4348 1485.1148 1590.9604 1605.5703 1646.6323 1682.4661 2965.4730 2978.7057 3011.1572 3027.8127 3075.0772 3083.7500 3116.9114 3117.3905 3122.4224 3127.5350 3131.9511 3144.6254 3155.9259 3158.4591 3171.0700 3528.3918
redmass: 3.6181 4.0126 3.4116 2.4083 1.1844 3.5398 3.0884 3.4045 3.5527 1.9610 3.8325 1.8516 3.1915 4.8141 3.9116 2.1743 3.1760 2.5111 2.7735 2.6276 3.3125 3.9051 4.6890 6.7814 6.4139 4.9757 5.0083 1.8833 3.7233 1.4619 1.9821 2.0633 1.2554 3.1209 1.9619 1.5626 3.7127 1.1437 3.2164 2.0467 2.7623 1.3964 2.1706 2.1946 2.0577 1.6556 2.4488 1.2663 3.3707 1.6315 2.7460 2.3048 1.2183 1.1893 1.3082 1.1880 1.2812 1.3390 1.3790 1.5066 8.7399 1.2011 1.1711 2.2038 1.0498 1.0763 1.0515 2.1516 1.0432 1.0620 6.2836 5.9891 10.4187 6.8436 1.0616 1.0354 1.0290 1.0980 1.0998 1.1009 1.0928 1.1051 1.0847 1.0886 1.0886 1.0937 1.1055 1.0977 1.0969 1.0650
irintensity: 2.5763 4.5380 0.1310 0.3645 0.1857 0.8397 1.4351 0.8950 0.7358 0.6129 1.2906 2.5254 6.6380 10.1431 0.8578 50.1994 40.7042 26.3991 24.5189 8.6836 7.1165 8.9762 6.8752 19.5182 0.1354 14.4365 4.3660 65.2250 30.7437 31.1145 4.5395 9.5545 0.3445 19.6609 12.2728 2.8562 32.0093 47.0392 9.7863 15.0031 18.8738 2.1663 13.9757 8.3633 20.5292 23.9583 41.6132 0.7684 233.7641 17.2629 27.6167 75.4799 5.1409 2.7793 3.8319 1.9850 3.7419 19.8135 4.8392 62.0245 0.1692 7.9013 19.8967 12.8949 16.1972 7.8016 16.0415 22.1660 9.8325 10.3896 0.6096 7.7523 110.8185 4.8217 39.0314 41.7105 30.8477 12.7643 52.1649 46.7175 3.0949 21.2005 0.1026 9.7195 9.5932 18.2873 12.5798 24.2073 14.9432 58.4719
temp: 298.150 k
press: 1.00000 atm
elementType: 8 8 8 6 6 6 6 6 6 6 6 6 6 6 6 6 1 1 1 1 1 1 1 1 1 1 1 1 1 1 1 1
symmnumber: 1
zpe: 677943.9 jmol-1
zpe.correction: 0.258215 hartree
zpe.thermalcorrener: 0.275363 hartree
zpe.thermalcorrenthalpy: 0.276307 hartree
zpe.thermalcorrgfe: 0.211277 hartree
zpe.sumelectzpe: -729.427050 hartree
zpe.sumelectthermal: -729.409902 hartree
zpe.sumelectthermalent: -729.408958 hartree
zpe.sumelectthermalfe: -729.473989 hartree
dipole: -1.2944 1.4645 0.7789
dipole: 2.1040
quadrupole: -88.0332 -82.0431 -94.7371
quadrupole: -2.8358 -1.7617 4.2885
quadrupole: 0.2380 6.2280 -6.4660 -2.8358 -1.7617 4.2885
hfenergy: -729.6852653 hartree
pointgroup: C01 [X(C13H16O3)]
dipole: 0.4682199 0.5830696 -0.3550054 debye
polarizability: 162.1513096|-12.0952465|151.3779213|10.7568538|1.2710818|134.1275956 unknown
InChI: InChI=1S/C13H16O3/c1-3-4-10-13(15,12(14)16-2)11-8-6-5-7-9-11/h4-10,15H,3H2,1-2H3
charge 0 multiplicity 1
32 atoms
O  -0.41963 0.510506 -1.726423
O  0.915999 2.55291 -0.862887
O  0.520312 2.164227 1.398259
C  -0.13345 0.441691 -0.296723
C  0.908984 -0.675811 0.006935
C  -1.432653 0.150455 0.456525
C  0.444123 1.790042 0.210364
C  1.212087 -1.62301 -0.999571
C  1.510539 -0.797183 1.285116
C  -2.631751 -0.019132 -0.149159
C  -3.918961 -0.353584 0.57398
C  2.114405 -2.6774 -0.734167
C  2.413444 -1.85218 1.545845
C  2.719258 -2.796027 0.538261
C  -4.530641 -1.694704 0.090773
C  1.534293 3.857308 -0.517667
H  -1.321238 0.065944 1.54474
H  0.728809 -1.522831 -1.975719
H  1.285441 -0.066396 2.07017
H  -2.676117 0.072178 -1.243064
H  -4.657342 0.456184 0.397661
H  -3.742828 -0.392914 1.665941
H  0.180597 1.194789 -2.123743
H  2.342525 -3.406852 -1.519847
H  2.877386 -1.935658 2.535206
H  3.4192 -3.614086 0.742736
H  -5.486385 -1.902427 0.60628
H  -4.72816 -1.670067 -0.997062
H  -3.8401 -2.533863 0.288807
H  2.41097 3.695326 0.130732
H  0.800673 4.491225 0.006636
H  1.825815 4.296541 -1.481431
