program: Gaussian 09
title: 000272003
version: EM64L-G09RevD.01
frameworkgroup: C1[X(C17H23N3O2)]
method: RPBEPBE
basis: SDD
operation: Freq
keyword: #p
keyword: freq=noraman
keyword: PBEPBE/SDD
title: #p freq=noraman PBEPBE/SDD
converged: YES YES NO NO
title: Mulliken charges:
elementType: O O N N N C C C C C C C C C C C C C C C C C H H H H H H H H H H H H H H H H H H H H H H H
charge: -0.225271 -0.259476 -0.218398 -0.090780 -0.407876 0.219242 -0.437535 -0.429982 -0.390625 -0.387000 0.112226 -0.023696 0.195617 -0.481537 -0.695034 -0.694798 0.448674 -0.448510 -0.379416 -0.220714 -0.229430 -0.245674 0.215033 0.214136 0.212688 0.211385 0.231737 0.241850 0.232027 0.208448 0.199355 0.344119 0.201173 0.220956 0.262427 0.211448 0.219321 0.211349 0.220254 0.262285 0.233914 0.259719 0.225156 0.223753 0.227462
chargesum: 0.00000
title: Mulliken charges with hydrogens summed into heavy atoms:
elementType: O O N N N C C C C C C C C C C C C C C C C C
charge: -0.225271 -0.259476 -0.218398 -0.090780 -0.063758 0.219242 -0.008366 -0.005909 0.082961 0.053474 0.112226 0.175659 0.195617 -0.059408 -0.001837 -0.000910 0.448674 -0.214596 -0.119697 0.004442 -0.005677 -0.018212
polarizability: 2.56629340e+02 -4.22041698e+00 2.02162206e+02 -1.43367282e+01 3.71753408e-01 1.47004319e+02
1716.lowfreq: 0.0003 0.0005 0.0006 3.3764 5.1560 8.9374 26.3169 29.3402 39.1648
frequency: 26.2088 29.2844 39.1016 54.3116 64.0990 84.3015 119.1473 154.8818 167.7326 175.4497 192.6798 207.6782 212.9898 225.5324 248.9192 268.7330 278.8118 299.6565 307.5808 337.2210 364.1489 371.1743 394.7167 406.5712 440.8555 444.7353 464.4740 501.6539 525.7508 567.9967 599.8378 603.9981 617.5483 641.3681 667.1032 700.7569 704.5443 706.5226 736.8227 739.8061 776.2938 807.4244 812.5870 825.9858 860.5604 896.1853 913.1462 924.5570 926.2575 938.1740 943.9381 983.2717 987.6938 989.9185 995.1707 1007.2503 1020.5405 1026.6307 1028.1597 1048.2880 1076.7030 1106.7269 1123.5054 1125.9335 1130.9464 1143.3481 1159.9999 1163.2731 1169.8842 1180.4825 1188.9886 1200.2273 1211.1723 1224.5791 1235.7663 1270.7773 1295.0886 1305.2117 1307.2872 1310.0512 1314.8443 1322.6830 1323.5567 1342.8936 1352.6197 1367.5645 1378.2996 1381.8336 1387.1275 1397.1765 1402.0180 1440.6414 1444.9657 1457.1631 1459.4645 1462.1528 1472.6954 1473.3910 1479.8818 1482.6595 1486.6154 1496.9155 1594.3436 1614.6725 1661.1823 1691.3272 2859.8925 2905.3862 2909.9806 2986.2125 2986.6488 2989.5939 2990.3281 2993.5777 3005.4984 3023.4040 3043.1385 3056.3735 3059.5762 3080.3726 3085.9382 3100.4272 3106.1587 3113.4999 3121.9621 3135.4153 3146.3647 3161.1504 3584.8172
redmass: 4.7853 3.9099 4.5230 3.0928 6.4433 4.5517 3.3012 4.2052 4.3110 5.8198 3.8366 2.6443 1.2153 2.2677 1.4401 2.3493 2.4151 2.3756 3.8103 2.9095 2.9505 3.5391 2.9530 2.8542 2.8940 3.6372 3.1304 3.9660 3.0965 3.2968 5.3687 5.3626 6.2956 1.1689 3.9471 8.0870 2.6851 2.4941 4.4010 1.8686 2.7619 3.4883 1.6385 3.5745 1.2477 2.2814 1.5259 1.2162 2.5685 1.9879 1.4355 1.3911 2.3291 5.4785 1.4421 1.7633 2.3242 2.0941 1.6181 2.2941 1.6246 2.6805 3.5522 3.6981 2.4829 2.3688 2.7910 2.4609 1.0615 1.1119 1.0868 2.3767 2.4772 1.4625 2.1111 1.4916 1.5293 1.3927 1.7066 2.5100 1.3935 2.0235 1.5051 1.3653 1.4287 1.4074 1.2079 3.0052 1.6423 1.4220 1.6193 2.1009 1.0860 1.1020 1.0425 1.1097 1.1261 1.0495 1.0509 1.9125 1.1484 1.0556 6.1589 6.1437 7.5881 10.2331 1.0701 1.0697 1.0687 1.0827 1.0396 1.0367 1.0598 1.0605 1.0837 1.0900 1.0903 1.1030 1.1031 1.1002 1.0996 1.1008 1.1000 1.0868 1.0863 1.0913 1.0956 1.1014 1.0802
irintensity: 0.3082 0.1074 0.2784 0.1269 0.0797 1.2676 0.1008 0.5594 5.1698 3.6163 0.9159 0.6275 0.0709 1.6056 0.1150 2.1019 4.6871 5.5605 5.7162 0.9145 1.3243 0.4382 18.3625 0.4217 0.7179 3.1877 14.2486 1.7028 18.1750 1.8647 2.7534 5.6166 0.0678 97.7644 20.4520 1.1329 14.6977 17.3780 72.3989 32.6202 18.2193 2.5571 1.6096 1.1349 0.2891 1.7797 2.9740 3.2359 14.8569 0.7366 0.1195 2.1004 31.8291 1.7998 3.4079 9.9407 73.2234 14.1763 0.8751 31.6584 11.7489 16.4291 1.6701 3.0824 54.7196 5.9243 9.3927 5.4522 0.4880 2.3279 1.7147 10.0220 4.4926 25.4300 52.4770 10.0906 31.8481 6.5180 26.1367 76.6706 10.2806 86.4489 45.9688 18.6923 65.2060 3.5058 30.1019 6.5412 72.0395 11.0331 18.8087 12.2066 4.8512 4.5569 0.8986 7.8256 12.5823 34.5620 3.1256 7.4998 26.8364 9.6943 0.9030 7.3992 511.6146 276.6070 70.5083 41.5457 56.0784 11.8060 35.5013 17.9542 15.1082 35.3761 15.9436 45.5002 20.6721 15.3730 33.2962 16.4707 59.3263 2.4659 23.1031 7.8293 0.1177 17.2973 35.7251 27.2256 72.7883
temp: 298.150 k
press: 1.00000 atm
elementType: 8 8 7 7 7 6 6 6 6 6 6 6 6 6 6 6 6 6 6 6 6 6 1 1 1 1 1 1 1 1 1 1 1 1 1 1 1 1 1 1 1 1 1 1 1
symmnumber: 1
zpe: 989736.9 jmol-1
zpe.correction: 0.376971 hartree
zpe.thermalcorrener: 0.397630 hartree
zpe.thermalcorrenthalpy: 0.398574 hartree
zpe.thermalcorrgfe: 0.326812 hartree
zpe.sumelectzpe: -974.694747 hartree
zpe.sumelectthermal: -974.674088 hartree
zpe.sumelectthermalent: -974.673144 hartree
zpe.sumelectthermalfe: -974.744906 hartree
dipole: 2.0120 1.5938 1.0914
dipole: 2.7892
quadrupole: -146.3769 -129.1342 -129.3064
quadrupole: -0.4584 -7.0638 -0.7651
quadrupole: -11.4377 5.8049 5.6328 -0.4584 -7.0638 -0.7651
hfenergy: -975.0717182 hartree
pointgroup: C01 [X(C17H23N3O2)]
dipole: -0.8247277 -0.5968023 0.4096495 debye
polarizability: 255.5376975|-6.3703881|202.5826197|16.6633657|-0.9027745|147.6755479 unknown
InChI: InChI=1S/C17H23N3O2/c1-13(2)20-16(22)18-15(21)17(20)8-10-19(11-9-17)12-14-6-4-3-5-7-14/h3-7,13,18H,8-12H2,1-2H3
charge 0 multiplicity 1
45 atoms
O  1.649763 2.807329 -0.485033
O  5.215685 -0.267081 -0.620588
N  2.921354 -0.525335 -0.001729
N  -1.181884 0.585344 0.720179
N  3.620867 1.511308 -0.657959
C  1.70876 0.345998 0.080937
C  0.580774 -0.146893 -0.874348
C  1.160415 0.42776 1.537156
C  -0.731182 0.641095 -0.694791
C  -0.17392 1.196003 1.623323
C  2.273146 1.719545 -0.380492
C  2.932717 -1.973685 0.339096
C  4.044891 0.156768 -0.437699
C  -2.529755 1.177282 0.904771
C  3.874716 -2.258975 1.53288
C  3.283149 -2.836199 -0.896588
C  -3.640122 0.351758 0.260265
C  -4.733097 0.988013 -0.377333
C  -3.619253 -1.064507 0.33179
C  -5.791737 0.22743 -0.926237
C  -4.672277 -1.827203 -0.218939
C  -5.76498 -1.18375 -0.848095
H  0.38303 -1.211831 -0.646764
H  0.922795 -0.081134 -1.923961
H  1.913686 0.898408 2.196122
H  0.991494 -0.606043 1.894721
H  -1.513175 0.183914 -1.326801
H  -0.590527 1.694693 -1.033938
H  -0.001557 2.272249 1.385229
H  -0.552532 1.1355 2.661273
H  1.897188 -2.213071 0.648205
H  4.266116 2.230698 -0.985582
H  -2.582684 2.227736 0.521512
H  -2.709855 1.233221 1.997785
H  4.915959 -2.010841 1.266969
H  3.826941 -3.329373 1.803587
H  3.585403 -1.663093 2.417109
H  3.238444 -3.908545 -0.633203
H  2.57385 -2.651405 -1.723176
H  4.302178 -2.603927 -1.248532
H  -4.755204 2.083065 -0.447634
H  -2.761796 -1.549007 0.812423
H  -6.63044 0.734043 -1.417398
H  -4.644341 -2.921454 -0.157708
H  -6.582799 -1.775211 -1.275205
