program: Gaussian 09
title: 000271990
version: EM64L-G09RevD.01
frameworkgroup: C1[X(C13H22O3)]
method: RPBEPBE
basis: SDD
operation: Freq
keyword: #pfreq=noraman
keyword: PBEPBE/SDD
title: #p freq=noraman PBEPBE/SDD
converged: YES YES NO NO
title: Mulliken charges:
elementType: O O O C C C C C C C C C C C C C H H H H H H H H H H H H H H H H H H H H H H
charge: -0.486737 -0.266733 -0.261864 -0.050784 -0.440389 -0.457382 -0.408565 -0.409111 0.138696 -0.385268 -0.273239 0.151504 -0.148446 -0.258338 -0.748009 -0.663666 0.232623 0.228763 0.212240 0.200004 0.231325 0.196317 0.187110 0.187339 0.196242 0.195248 0.192933 0.267084 0.364729 0.240776 0.239386 0.223406 0.227120 0.222614 0.222217 0.220715 0.228634 0.251504
chargesum: 0.00000
title: Mulliken charges with hydrogens summed into heavy atoms:
elementType: O O O C C C C C C C C C C C C C
charge: -0.122007 -0.266733 -0.261864 0.181839 0.000615 -0.026053 -0.025138 -0.025529 0.138696 0.002913 -0.006155 0.151504 0.092330 0.204454 -0.076059 0.037187
polarizability: 1.54784577e+02 -6.73708606e-01 1.55696797e+02 6.93294726e+00 -5.28190686e+00 1.34071884e+02
1716.lowfreq: -17.9160 -9.6843 0.0008 0.0009 0.0011 7.3513 30.7497 43.2034 49.2115
frequency: 30.3072 43.0537 49.1635 60.8501 70.6313 93.9029 98.3047 139.7599 156.2798 186.4068 200.5797 217.6750 233.7672 252.0355 271.1224 291.8688 314.3933 327.2134 355.5131 362.6758 394.7423 426.4297 430.1177 434.5139 484.6451 528.0176 568.4544 675.3649 728.7614 754.6647 773.5501 785.1223 814.1989 816.4519 826.0734 851.5599 886.4830 892.3089 913.0235 935.5637 965.5496 969.7188 986.8561 1011.2705 1046.5473 1048.9132 1053.7638 1056.8864 1077.0928 1092.1191 1096.3138 1113.2130 1129.1463 1146.8168 1157.2978 1164.8026 1194.3581 1231.7609 1254.5980 1261.8711 1272.5924 1277.2238 1286.3024 1300.6304 1302.2322 1326.6455 1334.1263 1338.1516 1339.9965 1341.5288 1355.6850 1361.6299 1391.9901 1393.2834 1457.6947 1459.5126 1460.8752 1461.8731 1464.2522 1465.2022 1469.2067 1470.1240 1478.4074 1485.1958 1599.9771 1674.6111 2959.7425 2960.2908 2964.9767 2967.9283 2972.2798 2977.8818 2985.1801 2994.1455 3020.4604 3024.6447 3031.6121 3033.6091 3038.8598 3039.5901 3050.7013 3076.0009 3089.2539 3095.7327 3104.9815 3114.5011 3121.9444 3450.4243
redmass: 2.4477 2.9622 3.4505 3.1363 4.6314 3.1453 1.9322 3.9364 3.0236 1.2478 2.2244 1.7486 1.6789 3.5862 3.3857 2.6243 2.9298 1.9093 4.6736 1.9508 2.2123 3.3952 3.0329 2.4362 1.7546 2.9095 4.9935 3.4551 4.2270 2.6309 1.9003 1.4628 2.2137 1.9404 2.7316 1.6740 2.1989 1.5642 1.7848 1.8011 2.3418 2.2709 1.2326 2.8729 1.5516 2.3776 1.1822 1.8847 1.7139 2.6867 2.2049 2.5122 3.0014 2.5990 1.6857 3.0217 1.6607 1.3505 1.2978 1.2597 1.3653 1.1297 1.2641 1.2386 1.2421 1.4470 1.3715 1.5075 1.4854 1.4370 1.3691 1.4656 1.2310 1.2304 1.0996 1.0887 1.0477 1.0878 1.0680 1.0678 1.0613 1.0836 1.0936 1.0522 8.6580 6.1840 1.0624 1.0619 1.0366 1.0629 1.0621 1.0813 1.0619 1.0361 1.0977 1.0940 1.1024 1.0595 1.0969 1.1022 1.1022 1.0974 1.0973 1.1034 1.0959 1.0871 1.1069 1.0649
irintensity: 0.1345 1.1731 0.8585 0.4542 1.1662 0.2854 1.1571 0.1805 1.3833 1.5809 0.9235 0.2634 0.7350 16.0959 2.5628 3.0651 3.8550 27.8816 27.6954 45.9420 16.7537 1.1415 0.8679 16.8871 1.4889 2.9785 7.4321 19.5701 5.5771 2.5478 2.2982 0.1803 0.6089 8.1978 3.6709 7.4967 0.5111 14.4126 3.7082 28.1122 23.2246 7.0699 49.1423 66.0431 0.1320 37.6771 0.1766 26.5727 12.6829 1.4293 28.3275 1.2635 104.9953 35.7212 1.5681 178.7999 19.1128 2.9453 0.0876 3.3733 8.2272 6.4049 1.5831 3.3130 1.7125 0.2579 15.7271 10.4866 8.0307 16.3296 8.8544 2.6703 22.4186 11.3888 15.5689 0.2335 12.6385 8.9902 19.6450 3.8189 21.2270 10.7675 3.0488 20.0169 144.5287 5.1767 20.9463 45.8189 44.6925 37.9178 48.3338 6.4876 18.4241 14.8323 81.2854 65.9576 26.1976 25.5943 25.4592 30.2194 86.7412 14.8882 37.0238 1.0407 8.3442 21.7898 25.2307 46.0480
temp: 298.150 k
press: 1.00000 atm
elementType: 8 8 8 6 6 6 6 6 6 6 6 6 6 6 6 6 1 1 1 1 1 1 1 1 1 1 1 1 1 1 1 1 1 1 1 1 1 1
symmnumber: 1
zpe: 857591.7 jmol-1
zpe.correction: 0.326639 hartree
zpe.thermalcorrener: 0.344947 hartree
zpe.thermalcorrenthalpy: 0.345891 hartree
zpe.thermalcorrgfe: 0.279655 hartree
zpe.sumelectzpe: -732.960499 hartree
zpe.sumelectthermal: -732.942192 hartree
zpe.sumelectthermalent: -732.941248 hartree
zpe.sumelectthermalfe: -733.007484 hartree
dipole: -1.5963 -0.7482 -2.9812
dipole: 3.4634
quadrupole: -93.3417 -91.7370 -101.1401
quadrupole: 1.5537 5.1961 0.9355
quadrupole: 2.0646 3.6692 -5.7338 1.5537 5.1961 0.9355
hfenergy: -733.2871389 hartree
pointgroup: C01 [X(C13H22O3)]
dipole: -0.7206931 -0.0626294 -1.1547305 debye
polarizability: 155.6833084|-2.046114|156.8978789|4.8840965|-0.6775014|131.9720716 unknown
InChI: InChI=1S/C13H22O3/c1-3-10-13(15,12(14)16-4-2)11-8-6-5-7-9-11/h3,10-11,15H,4-9H2,1-2H3
charge 0 multiplicity 1
38 atoms
O  0.282957 0.2058 2.176586
O  -1.890513 -0.502918 -0.693272
O  -1.942826 -1.151405 1.543059
C  0.923982 0.158246 -0.200512
C  2.141636 1.082041 0.055706
C  1.353304 -1.329644 -0.154658
C  3.289878 0.790149 -0.938902
C  2.504218 -1.622678 -1.146799
C  -0.226031 0.462215 0.819909
C  3.716126 -0.695782 -0.893821
C  -0.69655 1.923773 0.763833
C  -1.430667 -0.482995 0.607776
C  -1.419328 2.514905 -0.220689
C  -3.075888 -1.38086 -0.978804
C  -1.817824 3.97339 -0.222179
C  -2.625239 -2.812265 -1.277259
H  0.513166 0.383461 -1.206682
H  2.492056 0.922023 1.093841
H  1.833456 2.141981 -0.02471
H  0.490798 -1.986821 -0.386134
H  1.677355 -1.567487 0.877134
H  4.155072 1.443908 -0.71348
H  2.959151 1.041764 -1.968763
H  2.141722 -1.470891 -2.185353
H  2.808373 -2.684651 -1.066224
H  4.511762 -0.891287 -1.639199
H  4.144566 -0.921267 0.104531
H  -0.361537 2.500338 1.636937
H  -0.405339 -0.33852 2.651623
H  -1.748554 1.912928 -1.080036
H  -3.754063 -1.341361 -0.108839
H  -3.54339 -0.899547 -1.852403
H  -1.451398 4.495281 0.679202
H  -1.41317 4.496057 -1.111105
H  -2.919004 4.086338 -0.262013
H  -3.500521 -3.421208 -1.570386
H  -1.898058 -2.832776 -2.107144
H  -2.16838 -3.273931 -0.386172
