program: Gaussian 09
title: 000271980
version: EM64L-G09RevD.01
frameworkgroup: C1[X(C12H12O3)]
method: RPBEPBE
basis: SDD
operation: Freq
keyword: #pfreq=noraman
keyword: PBEPBE/SDD
title: #p freq=noraman PBEPBE/SDD
converged: YES YES NO NO
title: Mulliken charges:
elementType: O O O C C C C C C C C C C C C H H H H H H H H H H H H
charge: -0.448362 -0.232699 -0.251168 -0.070509 0.415793 -0.379639 -0.381842 0.196646 -0.229590 -0.224979 -0.240112 0.114760 -0.065879 -0.501479 -0.750746 0.243406 0.268465 0.223798 0.225355 0.226760 0.365960 0.245325 0.240710 0.248397 0.254627 0.250914 0.256087
chargesum: 0.00000
title: Mulliken charges with hydrogens summed into heavy atoms:
elementType: O O O C C C C C C C C C C C C
charge: -0.082402 -0.232699 -0.251168 -0.070509 0.415793 -0.136233 -0.113377 0.196646 -0.005791 0.000376 -0.013352 0.114760 -0.065879 0.232954 0.010881
polarizability: 1.63624751e+02 1.15504698e+01 1.24785550e+02 5.34382105e-01 2.09087471e+01 1.17682180e+02
1716.lowfreq: -6.8661 -4.0014 -0.0011 -0.0009 -0.0008 5.7507 9.9496 30.0402 46.9147
frequency: -6.6906 29.9958 46.8922 54.8953 61.6744 78.0558 92.7980 152.5878 185.6895 218.2363 242.6657 277.0864 293.0706 300.9887 350.4279 359.0076 403.0263 410.4455 426.6391 433.6175 501.1261 588.2280 615.6174 628.4291 694.4748 702.2145 729.2089 772.9686 856.0835 869.1629 891.5931 924.4351 939.9133 980.3832 990.6632 991.9642 998.4241 1026.9632 1029.9712 1032.2882 1083.5498 1113.0508 1142.0825 1150.7872 1171.1909 1178.6315 1185.9268 1221.2528 1314.2670 1339.4750 1383.9446 1400.0912 1421.3747 1435.6340 1454.2452 1458.7109 1460.0308 1460.7053 1478.3080 1595.8712 1608.0845 1617.3255 2280.4267 2977.6109 3009.4894 3066.1199 3067.8388 3114.8125 3123.5644 3135.2946 3149.5447 3159.0812 3160.9042 3171.6054 3457.1534
redmass: 1.0130 3.7748 5.0441 3.8094 4.0009 4.0379 1.1581 4.1352 4.0899 5.2156 4.4842 3.9828 4.2784 2.6073 6.4017 5.1607 2.8081 5.0379 1.7000 7.6270 4.1019 7.5586 6.3896 6.5627 7.7928 1.9650 3.4253 2.1944 1.2506 5.0800 5.9553 2.2804 2.6880 1.4577 5.2400 3.2199 1.7137 2.1606 1.4115 1.4008 1.6164 1.2628 2.8989 1.4700 1.0598 5.9367 1.1662 5.3822 1.3266 1.3965 9.7743 1.2231 1.1939 2.2230 1.0499 1.0412 1.0417 1.0504 2.2564 6.4755 6.6905 8.1551 11.7905 1.0351 1.0293 1.0985 1.0984 1.1052 1.0848 1.0889 1.0935 1.1052 1.0969 1.0979 1.0649
irintensity: 0.0137 0.0539 0.6867 1.6487 1.4753 2.7745 0.0647 2.9058 2.5542 5.5243 5.8548 8.1730 49.2042 36.2556 4.5670 27.1194 4.0156 19.0520 40.0223 2.2111 9.0952 13.4002 0.0913 17.3617 15.7985 37.0995 59.4570 28.6613 0.3748 4.3605 16.9748 17.6632 26.7193 2.2132 13.3483 46.1184 19.5432 9.5677 2.4258 2.6054 3.9396 0.0488 63.8948 5.9887 0.4872 256.0298 9.6445 42.9787 0.5701 63.4762 0.1645 1.6507 18.9664 16.9560 15.5374 12.9809 17.0207 6.0764 19.3629 0.0900 61.6551 124.4851 32.2045 30.4043 28.1965 12.0764 10.2333 20.7902 0.0220 12.7044 27.7299 9.3185 20.7161 11.6232 39.2824
temp: 298.150 k
press: 1.00000 atm
elementType: 8 8 8 6 6 6 6 6 6 6 6 6 6 6 6 1 1 1 1 1 1 1 1 1 1 1 1
symmnumber: 1
zpe: 542685.3 jmol-1
zpe.correction: 0.206698 hartree
zpe.thermalcorrener: 0.221718 hartree
zpe.thermalcorrenthalpy: 0.222662 hartree
zpe.thermalcorrgfe: 0.163043 hartree
zpe.sumelectzpe: -688.983839 hartree
zpe.sumelectthermal: -688.968820 hartree
zpe.sumelectthermalent: -688.967876 hartree
zpe.sumelectthermalfe: -689.027495 hartree
dipole: -1.3732 0.2693 -3.4583
dipole: 3.7307
quadrupole: -74.2822 -79.4304 -85.9766
quadrupole: 5.2590 3.5769 -0.1947
quadrupole: 5.6142 0.4660 -6.0802 5.2590 3.5769 -0.1947
hfenergy: -689.1905374 hartree
pointgroup: C01 [X(C12H12O3)]
dipole: 0.5515436 0.0108877 -1.3601607 debye
polarizability: 162.2086084|13.6588175|128.8050394|1.7098261|-20.1352322|115.0788339 unknown
InChI: InChI=1S/C12H12O3/c1-3-9-12(14,11(13)15-2)10-7-5-4-6-8-10/h4-8,14H,1-2H3
charge 0 multiplicity 1
27 atoms
O  0.504199 -0.294262 2.17446
O  0.954515 -1.423161 -1.283709
O  1.633193 -2.291823 0.765526
C  0.508964 -0.080574 0.721231
C  -0.947889 0.144211 0.270016
C  -1.255877 0.977203 -0.8299
C  -1.987173 -0.534815 0.949247
C  1.087239 -1.392778 0.080929
C  -2.595637 1.128142 -1.251094
C  -3.326215 -0.381702 0.527209
C  -3.635183 0.447706 -0.575819
C  1.420996 1.024149 0.34995
C  2.208859 1.935615 0.086902
C  1.513937 -2.618987 -1.96788
C  3.142701 3.030058 -0.210767
H  -0.449738 1.505518 -1.349429
H  -1.741063 -1.149348 1.820032
H  -2.82835 1.778314 -2.102022
H  -4.127591 -0.903051 1.062842
H  -4.674723 0.567648 -0.901578
H  1.213822 -0.96691 2.374759
H  2.596622 -2.692411 -1.772355
H  1.309202 -2.448373 -3.033123
H  1.010342 -3.529527 -1.603787
H  2.600758 3.950173 -0.496112
H  3.821532 2.764018 -1.041802
H  3.76516 3.266566 0.671673
