program: Gaussian 09
title: 000271992
version: EM64L-G09RevD.01
frameworkgroup: C1[X(C18H20O3)]
method: RPBEPBE
basis: SDD
operation: Freq
keyword: #pfreq=noraman
keyword: PBEPBE/SDD
title: #p freq=noraman PBEPBE/SDD
converged: NO YES NO NO
title: Mulliken charges:
elementType: O O O C C C C C C C C C C C C C C C C C C H H H H H H H H H H H H H H H H H H H H
charge: -0.481532 -0.261667 -0.256156 0.056481 -0.442672 -0.564554 0.344485 0.175548 0.500185 -0.366676 -0.387226 -0.417478 -0.409619 -0.241603 -0.223177 -0.241336 -0.229958 -0.231159 -0.218280 -0.245336 -0.672495 0.240054 0.231883 0.244939 0.224147 0.250979 0.279175 0.371374 0.233776 0.237852 0.224173 0.226672 0.228119 0.221245 0.221798 0.234994 0.235342 0.225284 0.217405 0.234294 0.230720
chargesum: 0.00000
title: Mulliken charges with hydrogens summed into heavy atoms:
elementType: O O O C C C C C C C C C C C C C C C C C C
charge: -0.110158 -0.261667 -0.256156 0.056481 0.029266 -0.095468 0.344485 0.175548 0.500185 -0.115696 -0.108051 -0.183701 -0.171767 -0.017430 0.003495 -0.013217 -0.008713 -0.009361 0.252056 -0.020052 0.009923
polarizability: 2.05498094e+02 -2.63650331e+01 1.88247485e+02 -1.54582023e-01 -7.44039389e+00 1.96134683e+02
1716.lowfreq: -5.2483 -4.0380 -0.0008 -0.0007 -0.0005 6.6400 21.2947 25.6911 29.5985
frequency: 21.2063 25.6635 29.4917 34.0267 48.0978 59.4909 73.6541 81.6469 103.8412 152.2827 166.3986 196.5647 209.8963 245.7654 267.2324 291.7407 303.4145 323.1842 343.9403 353.8405 388.4543 403.4468 404.4900 443.2602 487.3568 493.2062 522.7619 530.7078 584.8177 615.8763 617.9485 680.3194 697.1827 706.2293 712.8465 749.8349 767.9973 776.8137 790.1395 799.2566 813.3277 822.5578 854.3698 859.1920 904.5480 918.9970 929.4158 969.4758 976.2847 983.0132 989.7646 989.9193 992.6805 1002.5982 1016.5919 1018.7451 1026.7317 1033.4104 1046.7785 1060.5474 1081.9730 1099.6422 1113.9243 1134.1498 1154.3775 1170.8178 1171.3115 1179.5313 1186.1626 1186.8456 1214.4012 1218.8394 1249.0733 1273.6215 1293.6709 1311.8657 1328.1762 1334.1807 1354.7324 1360.9020 1379.7680 1382.1353 1401.4941 1432.7654 1440.2262 1453.7660 1464.1447 1472.5572 1475.2107 1483.1695 1485.4851 1487.3277 1589.9840 1592.3013 1597.3631 1609.1802 1613.9166 2996.9417 2999.4783 3008.1403 3016.9390 3055.9211 3077.0995 3079.8224 3093.5985 3110.2710 3112.4301 3114.7073 3122.6651 3129.5579 3133.2782 3140.7569 3147.9860 3159.3680 3159.7057 3172.0026 3440.0993
redmass: 3.6778 3.5014 4.3259 4.4012 3.1786 5.0159 4.5338 2.8279 3.9403 3.4677 3.2419 3.7588 4.3823 1.7386 2.6434 3.5634 3.3968 4.4577 2.8419 4.7378 4.2694 2.7561 2.8361 1.3212 2.8031 3.5292 4.4142 4.7601 5.0556 6.4019 6.3620 5.5865 4.9348 1.8083 1.6331 2.5523 2.0497 2.3033 1.7524 1.1098 3.5668 3.7862 1.2489 1.2460 2.9019 1.5495 1.4830 3.4586 1.3942 1.4842 5.6198 4.6227 1.3263 1.3545 2.2454 2.7673 2.1987 1.9147 3.6387 2.6530 1.6488 1.7351 2.2505 1.4557 1.8622 1.0552 1.0615 3.4858 1.1222 1.2231 2.0299 2.4776 1.1393 1.3302 1.2114 1.3446 1.2505 1.3550 1.3787 1.5325 8.7534 7.5374 1.2662 2.2153 2.1743 1.0889 1.0401 1.0909 2.0986 2.0984 1.0671 1.1653 6.2962 6.0496 9.2377 6.4373 6.1658 1.0359 1.0605 1.0599 1.0582 1.0997 1.1065 1.1037 1.0985 1.1035 1.0863 1.0870 1.0847 1.0911 1.0888 1.0960 1.0934 1.0975 1.1014 1.0968 1.0647
irintensity: 0.0403 0.2726 0.1668 0.1158 0.2922 1.0499 0.5918 0.6674 0.9807 1.9314 1.3319 1.3481 3.5763 1.5553 3.9030 4.9614 1.5924 8.4013 6.6741 27.4091 14.5946 3.4426 0.0148 93.3715 6.5745 9.8810 12.8519 10.1400 2.1551 0.1349 0.1183 10.7420 5.4558 26.4634 123.8210 26.1125 5.9945 29.8986 4.5559 3.2168 3.4776 13.2610 0.1307 0.2468 13.6123 4.1257 4.2070 5.1867 0.0117 0.2055 0.2541 0.6046 0.3366 2.2276 63.7053 9.3289 8.2557 1.6120 57.0684 74.3930 13.7897 27.0094 1.4955 5.8910 6.2412 0.7051 0.4809 318.2906 1.9787 42.5996 19.6493 1.9229 0.1379 11.3670 10.4966 1.3735 0.5157 22.5772 5.9391 26.6324 0.7263 0.1410 29.0436 11.7438 6.8403 5.6977 12.6287 5.9481 20.0681 25.0758 15.0131 5.1250 0.6977 2.7123 147.1705 27.5567 11.7231 15.4170 0.3372 36.6037 16.0816 0.0439 3.0688 23.6773 28.6038 39.7599 10.5260 3.9577 0.2858 12.6070 12.0561 46.2393 25.3692 19.8024 26.2614 13.8058 59.2204
temp: 298.150 k
press: 1.00000 atm
elementType: 8 8 8 6 6 6 6 6 6 6 6 6 6 6 6 6 6 6 6 6 6 1 1 1 1 1 1 1 1 1 1 1 1 1 1 1 1 1 1 1 1
symmnumber: 1
zpe: 877837.9 jmol-1
zpe.correction: 0.334351 hartree
zpe.thermalcorrener: 0.354670 hartree
zpe.thermalcorrenthalpy: 0.355614 hartree
zpe.thermalcorrgfe: 0.282080 hartree
zpe.sumelectzpe: -922.054468 hartree
zpe.sumelectthermal: -922.034149 hartree
zpe.sumelectthermalent: -922.033204 hartree
zpe.sumelectthermalfe: -922.106738 hartree
dipole: 1.4471 1.7372 2.7035
dipole: 3.5243
quadrupole: -121.0494 -113.1757 -119.8893
quadrupole: -1.0954 5.9870 2.2862
quadrupole: -3.0113 4.8624 -1.8511 -1.0954 5.9870 2.2862
hfenergy: -922.3888186 hartree
pointgroup: C01 [X(C18H20O3)]
dipole: -0.5363347 0.5727837 -1.1431879 debye
polarizability: 208.0970379|25.2076857|187.6459914|-2.9774577|8.4601132|194.1372327 unknown
InChI: InChI=1S/C18H20O3/c1-2-21-17(19)18(20,16-11-7-4-8-12-16)14-13-15-9-5-3-6-10-15/h3-12,20H,2,13-14H2,1H3
charge 0 multiplicity 1
41 atoms
O  -0.816139 0.178502 2.389896
O  -1.782261 2.042236 -0.598618
O  -2.472348 2.131069 1.620773
C  -0.943203 0.323248 0.938201
C  0.48692 0.513343 0.36188
C  1.419658 -0.680037 0.696737
C  -1.663722 -0.906182 0.327862
C  -1.810773 1.586243 0.69937
C  2.839549 -0.420559 0.216367
C  -1.897254 -1.000766 -1.068488
C  -2.066777 -1.970182 1.169155
C  3.266903 -0.850834 -1.066626
C  3.758401 0.295809 1.027554
C  -2.528777 -2.141945 -1.610089
C  -2.701236 -3.110446 0.625599
C  -2.935206 -3.201546 -0.765266
C  4.573768 -0.57331 -1.528673
C  5.06587 0.576248 0.571019
C  -2.639929 3.238915 -0.904665
C  5.478398 0.14347 -0.711219
C  -2.444091 3.551825 -2.382915
H  0.425781 0.655392 -0.731555
H  0.911644 1.439429 0.793459
H  1.397838 -0.832682 1.790831
H  1.017494 -1.596865 0.226533
H  -1.598222 -0.180162 -1.729318
H  -1.862871 -1.894315 2.241028
H  -1.524639 0.747213 2.804332
H  2.571181 -1.413281 -1.702523
H  3.445591 0.627296 2.025864
H  -2.705407 -2.203517 -2.690113
H  -3.007406 -3.92794 1.288313
H  -3.42653 -4.085921 -1.186515
H  4.887759 -0.918737 -2.520606
H  5.76335 1.125666 1.214015
H  -3.683931 2.979339 -0.65458
H  -2.3166 4.063738 -0.245162
H  6.493115 0.357001 -1.066137
H  -3.050835 4.433561 -2.658265
H  -1.386667 3.776716 -2.603025
H  -2.761389 2.703669 -3.013331
