program: Gaussian 09
title: 000271988
version: EM64L-G09RevD.01
frameworkgroup: C1[X(C15H18O3)]
method: RPBEPBE
basis: SDD
operation: Freq
keyword: #pfreq=noraman
keyword: PBEPBE/SDD
title: #p freq=noraman PBEPBE/SDD
converged: YES YES NO NO
title: Mulliken charges:
elementType: O O O C C C C C C C C C C C C C C C H H H H H H H H H H H H H H H H H H
charge: -0.448360 -0.233228 -0.249825 -0.052732 -0.339617 0.416660 -0.350017 -0.487189 -0.375064 -0.382967 -0.690328 0.190938 0.021654 -0.026775 -0.232854 -0.226522 -0.240950 -0.501168 0.209378 0.197646 0.192546 0.214784 0.230360 0.241377 0.238318 0.269730 0.217694 0.207345 0.213315 0.223752 0.225405 0.226748 0.366121 0.245443 0.240339 0.248043
chargesum: 0.00000
title: Mulliken charges with hydrogens summed into heavy atoms:
elementType: O O O C C C C C C C C C C C C C C C
charge: -0.082239 -0.233228 -0.249825 -0.052732 0.067407 0.416660 0.057312 -0.015452 -0.136746 -0.113237 -0.051974 0.190938 0.021654 -0.026775 -0.009102 -0.001117 -0.014202 0.232656
polarizability: 2.00802787e+02 8.32932829e+00 1.73856280e+02 -8.36272320e+00 1.42541022e+01 1.31946831e+02
1716.lowfreq: -11.6386 0.0007 0.0009 0.0010 1.5648 4.8850 11.8377 25.4905 31.9157
frequency: -6.0473 25.0363 31.8470 44.6397 48.3356 64.1768 73.4478 87.0153 92.5663 143.6319 165.1996 186.0287 221.9110 231.0658 245.9805 256.6945 288.3703 296.2869 314.7378 348.6992 384.0003 402.6381 408.4907 422.6851 426.0345 499.7508 549.2901 587.7287 616.2831 630.2131 693.7272 701.4197 724.5081 742.7295 772.8265 809.3283 830.6589 855.1137 873.5493 899.5959 923.8926 927.9838 937.0003 979.4645 990.2238 991.1462 997.9230 1000.8117 1027.7055 1060.8665 1084.1964 1098.8294 1107.6651 1113.1763 1141.7744 1150.4060 1171.0171 1177.0136 1184.0398 1209.5913 1215.9742 1232.8191 1287.6524 1302.3153 1312.6987 1321.0582 1338.6112 1357.5754 1384.3353 1390.6357 1421.2650 1435.5298 1452.9171 1453.9303 1460.9892 1462.6204 1473.8803 1478.7399 1478.9087 1486.1052 1596.0605 1608.2153 1617.2793 2269.8160 2968.0262 2970.4067 2974.1868 2981.7678 3009.8979 3012.6900 3020.4386 3047.6492 3071.3071 3073.7669 3115.1480 3123.3775 3134.7267 3148.2543 3159.2038 3159.9624 3172.2049 3460.2086
redmass: 3.4482 3.8097 3.8544 3.4241 3.5598 4.0076 2.0655 1.3122 2.8227 3.7096 3.4806 4.0292 5.7699 1.1371 2.4678 4.1015 3.4269 2.4278 4.3002 6.1854 3.9232 2.8926 4.5224 2.0320 4.8763 4.0424 3.5154 7.3684 6.3782 5.6235 7.4669 1.9625 2.5022 1.3060 2.1996 2.0170 2.0310 1.2471 4.6557 2.2646 2.2690 1.3899 2.3511 1.4294 4.3454 4.0754 1.5641 3.6017 2.1815 2.3953 1.6326 1.5955 1.9502 1.2625 2.6301 1.4668 1.0605 5.6898 1.1467 1.3688 3.8607 1.3190 1.1400 1.2598 1.3288 1.4111 1.3989 1.5334 9.7906 1.2120 1.1934 2.2237 1.0857 1.0515 1.0507 1.0732 1.0667 1.8047 1.1806 1.0757 6.4891 6.7881 8.1132 11.8581 1.0587 1.0572 1.0388 1.0615 1.0293 1.0983 1.0989 1.1033 1.1008 1.0994 1.1051 1.0847 1.0887 1.0934 1.1051 1.0975 1.0975 1.0649
irintensity: 0.3279 0.0550 0.0618 1.0396 0.7453 1.3253 0.4417 0.3329 1.6289 1.4333 1.9813 2.4460 8.6748 0.3164 0.6357 1.6330 58.9395 27.6021 15.0349 5.8314 16.7211 7.5548 19.3608 24.3662 6.8123 7.1630 4.4093 13.8923 0.1117 15.4529 18.0451 35.9955 56.4798 13.4787 26.9332 0.1686 2.3288 0.5064 2.2954 15.3440 18.4316 11.6515 20.7797 0.8755 34.4549 7.6870 3.9665 47.2855 10.1377 3.4416 1.6035 1.8467 1.3183 0.0206 61.0570 4.8977 1.2200 245.5109 8.2961 0.3794 38.7830 0.3198 0.4683 0.3348 0.0918 15.0737 63.4867 5.7452 0.2862 12.6108 19.2775 18.5541 11.2729 13.1569 10.1110 2.1787 2.3595 9.2948 22.1548 14.3179 0.3207 63.4922 125.6542 35.2361 11.8544 37.5709 23.4435 70.1785 28.1434 3.9422 21.3606 33.8350 92.7620 49.9966 20.8742 0.0277 11.0339 28.1502 7.6976 22.6978 11.7955 42.1836
temp: 298.150 k
press: 1.00000 atm
elementType: 8 8 8 6 6 6 6 6 6 6 6 6 6 6 6 6 6 6 1 1 1 1 1 1 1 1 1 1 1 1 1 1 1 1 1 1
symmnumber: 1
zpe: 763900.1 jmol-1
zpe.correction: 0.290954 hartree
zpe.thermalcorrener: 0.309828 hartree
zpe.thermalcorrenthalpy: 0.310773 hartree
zpe.thermalcorrgfe: 0.241756 hartree
zpe.sumelectzpe: -806.652596 hartree
zpe.sumelectthermal: -806.633722 hartree
zpe.sumelectthermalent: -806.632778 hartree
zpe.sumelectthermalfe: -806.701794 hartree
dipole: -2.0214 -0.3862 3.1885
dipole: 3.7950
quadrupole: -96.0340 -101.6818 -104.6094
quadrupole: 5.0201 5.1639 -2.7615
quadrupole: 4.7411 -0.9067 -3.8343 5.0201 5.1639 -2.7615
hfenergy: -806.9435501 hartree
pointgroup: C01 [X(C15H18O3)]
dipole: -0.7280611 0.1726714 -1.2920162 debye
polarizability: 198.0559273|-10.7688142|176.8350779|12.7417405|10.9651592|131.7148934 unknown
InChI: InChI=1S/C15H18O3/c1-3-4-5-9-12-15(17,14(16)18-2)13-10-7-6-8-11-13/h6-8,10-11,17H,3-5H2,1-2H3
charge 0 multiplicity 1
36 atoms
O  1.615791 1.00023 2.036564
O  1.245205 1.19495 -1.605373
O  2.342994 2.536685 -0.053061
C  0.962269 0.646743 0.769814
C  -4.056415 0.425374 0.589157
C  1.260804 -0.838319 0.48189
C  -3.927656 -0.017848 -0.884804
C  -3.108916 1.599798 0.970115
C  0.345791 -1.648166 -0.229077
C  2.497456 -1.381225 0.90361
C  -4.878141 -1.181572 -1.238145
C  1.604882 1.561168 -0.333222
C  -0.482612 0.96213 0.80782
C  -1.678155 1.260416 0.872586
C  0.666682 -2.992347 -0.520701
C  2.816143 -2.726027 0.612404
C  1.90369 -3.535565 -0.103007
C  1.77835 2.043115 -2.704188
H  -3.851294 -0.436058 1.25409
H  -5.099019 0.745315 0.788232
H  -4.134867 0.848311 -1.546181
H  -2.879417 -0.317264 -1.083537
H  -3.325742 2.46942 0.316703
H  -3.325924 1.92451 2.00731
H  -0.613417 -1.227163 -0.548456
H  3.182184 -0.754891 1.482548
H  -4.770952 -1.482581 -2.296292
H  -5.934926 -0.89794 -1.073616
H  -4.667924 -2.06864 -0.611425
H  -0.048324 -3.615708 -1.069477
H  3.772012 -3.14291 0.949137
H  2.150608 -4.579571 -0.327109
H  1.932388 1.942716 1.951058
H  1.443792 3.085335 -2.571619
H  1.363224 1.6015 -3.619843
H  2.880138 2.006481 -2.705903
