program: Gaussian 09
title: 000271985
version: EM64L-G09RevD.01
frameworkgroup: C1[X(C14H22O3)]
method: RPBEPBE
basis: SDD
operation: Freq
keyword: #pfreq=noraman
keyword: PBEPBE/SDD
title: #p freq=noraman PBEPBE/SDD
converged: YES YES NO NO
title: Mulliken charges:
elementType: O O O C C C C C C C C C C C C C C H H H H H H H H H H H H H H H H H H H H H H
charge: -0.459317 -0.245336 -0.255458 -0.050936 -0.447889 -0.457778 -0.408067 -0.407578 -0.385692 0.066728 0.153674 0.044089 -0.048035 -0.257889 -0.461730 -0.665101 -0.661908 0.234555 0.231521 0.213710 0.198443 0.235702 0.197515 0.188144 0.188133 0.196507 0.194827 0.193275 0.363323 0.236296 0.227232 0.236978 0.239245 0.220999 0.229274 0.252324 0.216606 0.229489 0.224128
chargesum: 0.00000
title: Mulliken charges with hydrogens summed into heavy atoms:
elementType: O O O C C C C C C C C C C C C C C
charge: -0.095994 -0.245336 -0.255458 0.183618 -0.002659 -0.023634 -0.022408 -0.022939 0.002411 0.066728 0.153674 0.044089 -0.048035 0.205639 0.014493 0.037495 0.008315
polarizability: 1.82528688e+02 -1.07728159e+01 1.65720090e+02 -5.37766803e+00 3.44683275e+00 1.32172634e+02
1716.lowfreq: -13.2670 -10.5162 -3.6422 -0.0006 -0.0005 0.0007 20.4432 35.9309 39.1206
frequency: 19.9103 35.9162 39.1021 46.9481 51.9614 66.3694 86.7619 112.8076 126.3688 156.6222 175.4574 208.9654 212.1311 229.0256 254.9260 282.5703 287.7139 310.1640 320.4323 336.4458 363.9736 386.4518 414.0380 428.1308 447.7180 454.9838 485.2023 505.4934 564.7369 645.8469 711.3671 740.3346 778.5262 784.0997 798.4061 804.9935 815.2731 847.5182 851.2338 885.7618 894.5990 916.8606 954.3980 963.8723 987.5456 1011.1840 1051.6294 1055.5809 1060.2816 1064.9946 1081.3258 1082.5438 1095.0352 1113.7308 1141.0557 1156.8855 1170.1556 1174.9557 1204.9028 1238.5381 1252.7741 1254.6963 1265.6990 1276.0890 1287.9478 1304.4187 1315.5464 1329.0621 1331.6152 1336.1550 1340.4325 1341.7281 1354.0173 1361.3810 1389.8119 1392.2066 1456.8916 1459.3744 1459.5079 1462.0428 1462.9974 1464.0963 1467.3711 1474.0146 1476.4684 1484.3543 1484.6637 1607.5550 2268.0418 2959.2392 2960.8151 2968.5361 2974.7383 2976.4061 2986.5116 2989.2672 2990.9256 2994.2045 3021.2775 3021.8975 3025.4980 3032.2690 3033.5177 3044.1359 3054.8501 3089.0055 3090.1438 3096.1747 3098.7131 3122.7525 3464.5734
redmass: 2.3979 3.3337 3.4606 3.7768 2.7066 3.5481 3.7367 3.8815 3.6214 3.3622 2.1218 1.3602 1.7904 1.6646 3.4889 3.2791 2.6295 1.8397 2.4052 3.9037 2.8516 2.0854 3.9653 3.0323 3.3864 3.7121 1.6574 4.4153 5.3491 5.8972 4.1530 2.9959 1.1802 1.4648 2.3841 2.8938 1.8017 2.4204 2.1761 2.2878 1.5319 1.9315 3.0542 2.5936 2.7450 2.8733 2.1538 1.1411 2.3987 2.1974 1.3600 1.4684 2.1681 2.5955 2.5882 1.6752 3.6170 2.4041 2.1999 1.3894 1.1454 1.2952 1.2581 1.1250 1.2310 1.2590 1.5155 1.4307 1.4003 1.4148 1.4977 1.4682 1.3159 1.4702 1.1933 1.2317 1.0997 1.0775 1.0857 1.0706 1.0872 1.0649 1.0836 1.0413 1.0938 1.0524 1.0538 9.1267 11.8528 1.0622 1.0627 1.0627 1.0627 1.0588 1.0737 1.0700 1.0352 1.0361 1.1004 1.0977 1.0942 1.0602 1.1026 1.1013 1.1019 1.0974 1.1003 1.1028 1.1014 1.1066 1.0650
irintensity: 0.0735 1.0978 0.9284 0.4652 0.2265 1.6721 0.7145 0.0739 2.1063 1.1633 1.0433 1.6442 0.2650 1.4264 26.3921 9.5466 1.2060 48.2492 2.6601 44.0568 4.8296 52.0032 7.3646 0.1073 2.8091 4.8219 1.6822 2.2313 4.5725 20.4506 32.9240 1.0310 7.1809 0.1450 0.1051 2.3638 8.5237 5.5971 20.7231 5.7815 7.3594 1.5229 18.7909 15.4073 7.0321 62.1912 22.4032 0.3606 54.8227 49.8856 1.9786 3.6911 18.6043 0.0424 42.9485 2.3791 104.2069 130.3626 54.5415 5.4160 0.2887 0.1129 1.1241 5.8561 3.6080 2.2368 21.2148 10.0610 28.2384 6.2256 2.0017 6.0298 3.4056 3.1490 8.3471 25.1010 13.5257 5.5930 4.4827 9.5607 9.4911 14.8026 13.0471 12.3882 3.5508 16.6804 9.7059 148.4406 20.4597 23.1786 45.6982 39.5144 53.4430 28.1808 7.7345 16.9401 38.9203 15.0554 7.9628 76.9861 69.0914 25.0466 32.9072 22.7736 80.9814 36.3192 44.6007 1.2099 33.8769 26.1523 36.0285
temp: 298.150 k
press: 1.00000 atm
elementType: 8 8 8 6 6 6 6 6 6 6 6 6 6 6 6 6 6 1 1 1 1 1 1 1 1 1 1 1 1 1 1 1 1 1 1 1 1 1 1
symmnumber: 1
zpe: 871187.5 jmol-1
zpe.correction: 0.331818 hartree
zpe.thermalcorrener: 0.351440 hartree
zpe.thermalcorrenthalpy: 0.352384 hartree
zpe.thermalcorrgfe: 0.281827 hartree
zpe.sumelectzpe: -770.964916 hartree
zpe.sumelectthermal: -770.945293 hartree
zpe.sumelectthermalent: -770.944349 hartree
zpe.sumelectthermalfe: -771.014906 hartree
dipole: 1.2262 1.4232 -2.8207
dipole: 3.3890
quadrupole: -94.4812 -93.3544 -106.1723
quadrupole: -3.5452 -2.7038 -2.9298
quadrupole: 3.5214 4.6482 -8.1697 -3.5452 -2.7038 -2.9298
hfenergy: -771.2967334 hartree
pointgroup: C01 [X(C14H22O3)]
dipole: -0.704805 -0.3576677 -1.0738266 debye
polarizability: 177.244234|-13.7475266|171.7026576|-1.0092741|-0.3778667|131.4745206 unknown
InChI: InChI=1S/C14H22O3/c1-3-5-11-14(16,13(15)17-4-2)12-9-7-6-8-10-12/h12,16H,3-4,6-10H2,1-2H3
charge 0 multiplicity 1
39 atoms
O  0.254705 0.315079 1.970409
O  -1.084799 -1.598097 -0.859677
O  -1.179543 -1.917449 1.447329
C  1.079953 0.29564 -0.337924
C  1.735464 1.688697 -0.174694
C  2.100786 -0.830101 -0.038159
C  2.993508 1.821535 -1.065599
C  3.359956 -0.695808 -0.928187
C  4.014616 0.696735 -0.773899
C  -0.186798 0.170234 0.573009
C  -0.856751 -1.230354 0.446128
C  -1.224567 1.174057 0.2420
C  -2.092215 2.015789 -0.007168
C  -1.774018 -2.914062 -1.08108
C  -3.143525 3.011007 -0.285027
C  -0.764323 -4.063739 -1.067775
C  -4.55666 2.539827 0.152545
H  0.724605 0.188251 -1.383171
H  2.009866 1.827753 0.888518
H  1.003188 2.4790 -0.427205
H  1.637884 -1.824296 -0.201038
H  2.385012 -0.772403 1.029652
H  3.460151 2.813505 -0.908416
H  2.695786 1.773322 -2.134338
H  3.076034 -0.847254 -1.990874
H  4.08561 -1.492749 -0.673567
H  4.888457 0.786079 -1.448688
H  4.393638 0.808661 0.26291
H  -0.320915 -0.284891 2.521373
H  -2.541067 -3.038803 -0.296842
H  -2.249193 -2.785495 -2.066147
H  -3.150256 3.243948 -1.368254
H  -2.892876 3.95735 0.233946
H  -1.278588 -5.009189 -1.321779
H  0.034779 -3.896673 -1.810461
H  -0.310329 -4.177479 -0.069289
H  -5.307786 3.317691 -0.074523
H  -4.582433 2.335874 1.236819
H  -4.842154 1.614108 -0.376458
