program: Gaussian 09
title: 000271971
version: EM64L-G09RevD.01
frameworkgroup: C1[X(C7H15NO)]
method: RPBEPBE
basis: SDD
operation: Freq
keyword: #p
keyword: freq=noraman
keyword: PBEPBE/SDD
title: #p freq=noraman PBEPBE/SDD
converged: YES YES YES YES
title: Mulliken charges:
elementType: O N C C C C C C C H H H H H H H H H H H H H H H
charge: -0.459603 -0.051637 -0.012350 -0.404520 -0.429775 -0.393110 -0.384303 -0.385752 -0.617640 0.214358 0.228646 0.190500 0.202752 0.188231 0.211429 0.172595 0.171082 0.210508 0.191590 0.186871 0.220599 0.184306 0.222512 0.342711
chargesum: 0.00000
title: Mulliken charges with hydrogens summed into heavy atoms:
elementType: O N C C C C C C C
charge: -0.116892 -0.051637 0.202008 0.014625 -0.038792 -0.009086 -0.002713 -0.007291 0.009778
polarizability: 1.01335375e+02 1.66121740e-01 8.22237247e+01 -1.41476792e+00 -4.32571610e-01 6.92080725e+01
1716.lowfreq: -19.6609 -5.7638 -0.0005 0.0005 0.0006 11.1901 77.1296 112.0457 179.3663
frequency: 77.1201 112.0316 179.3633 213.1727 225.5582 247.2986 261.1655 321.2544 343.1865 357.2212 431.3854 459.5946 488.3683 587.6441 740.3590 810.6280 817.2776 906.9592 955.8917 966.0710 976.7210 988.3441 1028.7973 1068.0371 1076.6165 1092.7805 1117.8517 1132.3619 1142.2246 1153.0960 1177.6718 1210.5546 1233.1360 1269.4268 1274.0531 1279.7138 1300.1953 1318.8462 1343.7902 1350.0831 1364.9634 1374.9468 1410.1155 1429.5686 1450.0956 1461.0659 1462.6325 1463.5072 1474.2918 1479.4155 1481.3381 2808.2714 2819.5851 2850.1922 2921.8551 2961.1844 2974.0458 2979.4499 2988.7896 3013.6536 3016.3133 3022.4549 3037.1991 3065.6457 3072.5339 3572.8933
redmass: 3.6366 3.0877 3.2819 1.2407 1.9130 1.4948 1.2092 3.5252 1.9895 2.5030 1.9246 3.1752 3.3726 2.1335 3.4708 1.7399 1.8355 1.9990 2.1049 1.8120 1.7627 2.1272 2.7342 1.6469 1.7960 1.5455 2.0338 1.9448 1.8837 1.3770 1.3127 1.3939 1.4032 1.4493 1.5005 1.4496 1.3323 1.2847 1.3829 1.4083 1.5991 1.3976 1.4421 1.1789 1.0900 1.0625 1.0787 1.0771 1.0791 1.1040 1.0581 1.0713 1.0689 1.0580 1.0545 1.0882 1.0596 1.0885 1.0759 1.0722 1.0859 1.0877 1.1021 1.0990 1.1009 1.0666
irintensity: 0.9840 10.3438 4.7436 0.0894 21.1200 4.5042 133.6448 0.9304 4.3401 1.2665 3.0714 8.4233 4.9753 1.4491 9.9052 0.6847 1.8480 4.1135 22.7015 2.0083 29.2548 57.2567 10.0426 21.2528 11.4673 8.3563 4.8702 10.9096 15.5624 4.7456 6.4414 2.5456 18.9834 15.6180 11.0152 22.2237 3.8077 1.5881 2.4391 0.7906 5.2020 4.0421 2.6703 3.6700 6.6231 17.9450 11.1005 5.1616 11.7849 7.1373 7.7679 57.0069 96.1530 210.1592 64.7782 9.5678 44.9830 26.8150 65.1905 41.4645 79.5851 40.1504 71.3547 34.7509 38.8252 1.9848
temp: 298.150 k
press: 1.00000 atm
elementType: 8 7 6 6 6 6 6 6 6 1 1 1 1 1 1 1 1 1 1 1 1 1 1 1
symmnumber: 1
zpe: 562196.2 jmol-1
zpe.correction: 0.214129 hartree
zpe.thermalcorrener: 0.223983 hartree
zpe.thermalcorrenthalpy: 0.224927 hartree
zpe.thermalcorrgfe: 0.179695 hartree
zpe.sumelectzpe: -404.937261 hartree
zpe.sumelectthermal: -404.927407 hartree
zpe.sumelectthermalent: -404.926463 hartree
zpe.sumelectthermalfe: -404.971695 hartree
dipole: 0.5969 1.2256 -0.1888
dipole: 1.3762
quadrupole: -48.4750 -56.2195 -59.0246
quadrupole: 3.4704 -4.8583 0.8307
quadrupole: 6.0980 -1.6465 -4.4515 3.4704 -4.8583 0.8307
hfenergy: -405.1513902 hartree
pointgroup: C01 [X(C7H15N1O1)]
dipole: -0.2321102 -0.4824306 -0.080835 debye
dipolederiv: -0.5651002 0.2527683 0.1977287 0.3246633 -0.5645963 0.0633014 0.2538885 0.0532771 -0.4857598 -0.6724694 -0.0227883 -0.0431858 -0.0187012 -0.5208417 -0.0076236 0.0121979 -0.002287 -0.5686208 -0.0397371 0.0185809 -0.0191806 -0.0131115 0.0295681 -0.0075684 -0.0828368 -0.0111226 0.1159577 -0.0630426 -0.0171255 -0.0153226 0.0141621 0.0288011 0.0233199 -0.0200111 -0.0055438 0.1424645 -0.0644158 -0.000319 -0.018024 -0.0364702 0.0884917 -0.0329016 -0.0415081 0.0098835 0.1452849 0.2267836 -0.1704616 -0.0557819 -0.2159774 0.3478108 0.0788943 -0.0241607 0.1029566 0.4283458 0.1563271 0.1109499 -0.0471318 0.1613941 0.4091016 -0.0883651 -0.0147659 -0.1026021 0.4531116 0.5356566 -0.199371 -0.131052 -0.2057796 0.4620479 0.0022871 -0.1089575 -0.0004241 0.3958198 0.4769698 0.0556641 0.0847889 0.054642 0.0987331 0.0270228 0.0970425 0.0280231 0.375425 0.0598885 0.0047614 -0.0287037 -0.0170015 0.0320991 -0.0134586 0.0127855 -0.0001964 -0.1739834 0.0238431 0.1026229 0.020642 0.0989905 -0.0794774 -0.0313753 0.0297352 -0.0611564 0.0673106 0.0534522 -0.0256176 -0.0161402 -0.0374909 0.0602546 -0.043368 -0.0366998 0.0272494 -0.1775172 0.0481472 0.012122 -0.0234275 0.0273917 0.0706102 0.0114682 -0.0261178 -0.0680962 -0.1701395 0.008196 -0.1007503 0.0309083 -0.077199 -0.1661849 0.0660265 0.0431407 0.1028207 0.0422539 -0.0200198 -0.1201098 0.0425929 -0.0748137 -0.1396334 0.0509012 0.0539695 0.0801697 0.0345852 -0.0183497 0.0432603 -0.0245827 0.0604449 -0.0054173 0.0153162 0.0310115 -0.1525087 -0.2842743 0.0021616 -0.0453083 -0.0074405 -0.0567957 -0.0212921 -0.0426296 0.0044106 0.1351338 -0.2998472 -0.0759521 0.1445844 0.0378182 0.1000962 -0.0951843 -0.0253162 0.0598765 -0.0512006 0.0443529 -0.045083 -0.0577985 0.0376549 -0.0598028 -0.232544 0.0351156 0.0623754 0.0743742 0.0248817 0.013652 0.0395481 0.0372193 0.0587243 0.0121899 -0.0018396 0.0010832 -0.0584234 -0.2345038 -0.0317731 0.080684 0.0289869 0.1803592 -0.0576604 -0.0799683 0.0320633 -0.0763016 0.0533918 -0.0750849 -0.0188051 -0.0000486 -0.0298102 0.0619214 -0.0170748 -0.2240023 -0.046556 -0.2732536 0.0337857 -0.0564241 0.0129684 -0.154127 -0.0997936 0.0973273 0.0261398 0.095834 0.0364373 0.0321642 -0.0306673 -0.1012866 -0.0837876 0.2809959 -0.0794912 -0.1406599 -0.0733033 0.3082765 unknown
polarizability: 101.3000207|0.2220659|82.216982|1.7568335|0.5500746|69.2501699 unknown
InChI: InChI=1S/C7H15NO/c1-8-4-2-7(6-9)3-5-8/h7,9H,2-6H2,1H3
charge 0 multiplicity 1
24 atoms
O  -3.315418 0.616466 0.289133
N  1.834331 0.101567 -0.257669
C  -1.052432 -0.253432 0.232059
C  -0.46241 1.073536 -0.299468
C  -0.133092 -1.429066 -0.17931
C  0.995421 1.251397 0.162788
C  1.316683 -1.177351 0.282719
C  -2.489095 -0.479408 -0.250826
C  3.25812 0.304718 0.069705
H  -1.080854 -0.202165 1.341583
H  -1.07945 1.922179 0.046146
H  -0.487548 1.064319 -1.407865
H  -0.139318 -1.538384 -1.282278
H  -0.496832 -2.380838 0.257342
H  1.423842 2.171636 -0.277852
H  1.015617 1.378665 1.279466
H  1.348477 -1.186911 1.40677
H  1.974159 -1.994877 -0.069654
H  -2.859662 -1.463018 0.11375
H  -2.516909 -0.481388 -1.363666
H  3.856121 -0.539145 -0.319925
H  3.453249 0.386374 1.170514
H  3.622092 1.23178 -0.409041
H  -4.250893 0.504044 -0.013322
